myfaces-commits mailing list archives

Site index · List index
Message view « Date » · « Thread »
Top « Date » · « Thread »
From Apache Jenkins Server <jenk...@builds.apache.org>
Subject Build failed in Jenkins: myfaces-trinidad-core-1.0 #579
Date Thu, 12 Jan 2012 07:26:52 GMT
See <https://builds.apache.org/job/myfaces-trinidad-core-1.0/579/>

------------------------------------------
Started by upstream project "maven-plugins" build number 574
Building remotely on ubuntu1
Updating https://svn.apache.org/repos/asf/myfaces/trinidad/branches/trinidad-1.0.x
At revision 1230422
no change for https://svn.apache.org/repos/asf/myfaces/trinidad/branches/trinidad-1.0.x since
the previous build
Parsing POMs
[myfaces-trinidad-core-1.0] $ /home/hudson/tools/java/latest1.5/bin/java -cp /home/jenkins/jenkins-slave/maven3-agent.jar:/home/hudson/tools/maven/latest/boot/plexus-classworlds-2.4.jar
org.jvnet.hudson.maven3.agent.Maven3Main /home/hudson/tools/maven/latest /home/jenkins/jenkins-slave/slave.jar
/home/jenkins/jenkins-slave/maven3-interceptor.jar 53820
<===[JENKINS REMOTING CAPACITY]===>channel started
   Executing Maven:  -B -f <https://builds.apache.org/job/myfaces-trinidad-core-1.0/ws/pom.xml>
clean install deploy
[INFO] Scanning for projects...
[WARNING] 
[WARNING] Some problems were encountered while building the effective model for org.apache.myfaces.trinidad:trinidad-build:jar:1.0.14-SNAPSHOT
[WARNING] The expression ${pom.version} is deprecated. Please use ${project.version} instead.
[WARNING] The expression ${pom.version} is deprecated. Please use ${project.version} instead.
[WARNING] The expression ${pom.version} is deprecated. Please use ${project.version} instead.
[WARNING] The expression ${pom.version} is deprecated. Please use ${project.version} instead.
[WARNING] 'reporting.plugins.plugin.version' for org.codehaus.mojo:rat-maven-plugin is missing.
@ org.apache.myfaces.trinidad:trinidad:1.0.14-SNAPSHOT, <https://builds.apache.org/job/myfaces-trinidad-core-1.0/ws/pom.xml,>
line 507, column 15
[WARNING] 
[WARNING] Some problems were encountered while building the effective model for org.apache.myfaces.trinidad:trinidad-api:jar:1.0.14-SNAPSHOT
[WARNING] The expression ${pom.version} is deprecated. Please use ${project.version} instead.
[WARNING] The expression ${pom.version} is deprecated. Please use ${project.version} instead.
[WARNING] The expression ${pom.version} is deprecated. Please use ${project.version} instead.
[WARNING] The expression ${pom.version} is deprecated. Please use ${project.version} instead.
[WARNING] 'reporting.plugins.plugin.version' for org.codehaus.mojo:rat-maven-plugin is missing.
@ org.apache.myfaces.trinidad:trinidad:1.0.14-SNAPSHOT, <https://builds.apache.org/job/myfaces-trinidad-core-1.0/ws/pom.xml,>
line 507, column 15
[WARNING] 'reporting.plugins.plugin.version' for org.apache.myfaces.trinidadbuild:maven-tagdoc-plugin
is missing. @ line 188, column 15
[WARNING] 'reporting.plugins.plugin.version' for org.apache.maven.plugins:maven-javadoc-plugin
is missing. @ line 199, column 15
[WARNING] 'reporting.plugins.plugin.version' for org.apache.maven.plugins:maven-jxr-plugin
is missing. @ line 208, column 15
[WARNING] 
[WARNING] Some problems were encountered while building the effective model for org.apache.myfaces.trinidad:trinidad-impl:jar:1.0.14-SNAPSHOT
[WARNING] The expression ${pom.version} is deprecated. Please use ${project.version} instead.
[WARNING] The expression ${pom.version} is deprecated. Please use ${project.version} instead.
[WARNING] The expression ${pom.version} is deprecated. Please use ${project.version} instead.
[WARNING] The expression ${pom.version} is deprecated. Please use ${project.version} instead.
[WARNING] 'reporting.plugins.plugin.version' for org.codehaus.mojo:rat-maven-plugin is missing.
@ org.apache.myfaces.trinidad:trinidad:1.0.14-SNAPSHOT, <https://builds.apache.org/job/myfaces-trinidad-core-1.0/ws/pom.xml,>
line 507, column 15
[WARNING] 
[WARNING] Some problems were encountered while building the effective model for org.apache.myfaces.trinidad:trinidad-blank:war:1.0.14-SNAPSHOT
[WARNING] The expression ${pom.version} is deprecated. Please use ${project.version} instead.
[WARNING] The expression ${pom.version} is deprecated. Please use ${project.version} instead.
[WARNING] The expression ${pom.version} is deprecated. Please use ${project.version} instead.
[WARNING] The expression ${pom.version} is deprecated. Please use ${project.version} instead.
[WARNING] 'reporting.plugins.plugin.version' for org.codehaus.mojo:rat-maven-plugin is missing.
@ org.apache.myfaces.trinidad:trinidad:1.0.14-SNAPSHOT, <https://builds.apache.org/job/myfaces-trinidad-core-1.0/ws/pom.xml,>
line 507, column 15
[WARNING] 
[WARNING] Some problems were encountered while building the effective model for org.apache.myfaces.trinidad:trinidad-demo:war:1.0.14-SNAPSHOT
[WARNING] The expression ${pom.version} is deprecated. Please use ${project.version} instead.
[WARNING] The expression ${pom.version} is deprecated. Please use ${project.version} instead.
[WARNING] The expression ${pom.version} is deprecated. Please use ${project.version} instead.
[WARNING] The expression ${pom.version} is deprecated. Please use ${project.version} instead.
[WARNING] 'reporting.plugins.plugin.version' for org.codehaus.mojo:rat-maven-plugin is missing.
@ org.apache.myfaces.trinidad:trinidad:1.0.14-SNAPSHOT, <https://builds.apache.org/job/myfaces-trinidad-core-1.0/ws/pom.xml,>
line 507, column 15
[WARNING] 
[WARNING] Some problems were encountered while building the effective model for org.apache.myfaces.trinidad:trinidad-example:pom:1.0.14-SNAPSHOT
[WARNING] The expression ${pom.version} is deprecated. Please use ${project.version} instead.
[WARNING] The expression ${pom.version} is deprecated. Please use ${project.version} instead.
[WARNING] The expression ${pom.version} is deprecated. Please use ${project.version} instead.
[WARNING] The expression ${pom.version} is deprecated. Please use ${project.version} instead.
[WARNING] 'reporting.plugins.plugin.version' for org.codehaus.mojo:rat-maven-plugin is missing.
@ org.apache.myfaces.trinidad:trinidad:1.0.14-SNAPSHOT, <https://builds.apache.org/job/myfaces-trinidad-core-1.0/ws/pom.xml,>
line 507, column 15
[WARNING] 
[WARNING] Some problems were encountered while building the effective model for org.apache.myfaces.trinidad:trinidad:pom:1.0.14-SNAPSHOT
[WARNING] The expression ${pom.version} is deprecated. Please use ${project.version} instead.
[WARNING] The expression ${pom.version} is deprecated. Please use ${project.version} instead.
[WARNING] The expression ${pom.version} is deprecated. Please use ${project.version} instead.
[WARNING] The expression ${pom.version} is deprecated. Please use ${project.version} instead.
[INFO] [WARNING] 'reporting.plugins.plugin.version' for org.codehaus.mojo:rat-maven-plugin
is missing. @ line 507, column 15
[WARNING] 
[WARNING] It is highly recommended to fix these problems because they threaten the stability
of your build.
[WARNING] 
[WARNING] For this reason, future Maven versions might no longer support building such malformed
projects.
[WARNING] 
------------------------------------------------------------------------
[INFO] Reactor Build Order:
[INFO] 
[INFO] Apache MyFaces Trinidad
[INFO] Apache MyFaces Trinidad Build
[INFO] Apache MyFaces Trinidad API
[INFO] Apache MyFaces Trinidad Impl
[INFO] Apache MyFaces Trinidad Examples
[INFO] Apache MyFaces Trinidad Blank Demo
[INFO] Apache MyFaces Trinidad Demo
[INFO] Downloading: http://repository.apache.org/snapshots/org/apache/maven/plugins/maven-pmd-plugin/maven-metadata.xml
                                                                        
[INFO] ------------------------------------------------------------------------
[INFO] Building Apache MyFaces Trinidad 1.0.14-SNAPSHOT
[INFO] ------------------------------------------------------------------------
Downloaded: http://repository.apache.org/snapshots/org/apache/maven/plugins/maven-pmd-plugin/maven-metadata.xml
(332 B at 1.9 KB/sec)
[INFO] 
[INFO] --- maven-clean-plugin:2.3:clean (default-clean) @ trinidad ---
[INFO] Deleting file set: <https://builds.apache.org/job/myfaces-trinidad-core-1.0/ws/target>
(included: [**], excluded: [])
log4j:WARN No appenders could be found for logger (org.apache.commons.beanutils.converters.BooleanConverter).
log4j:WARN Please initialize the log4j system properly.
[INFO] 
[INFO] --- maven-xrts-plugin:1.2.6:generate-sources (default) @ trinidad ---
[INFO] 
[INFO] --- maven-remote-resources-plugin:1.0-alpha-6:process (default) @ trinidad ---
[INFO] Setting property: classpath.resource.loader.class => 'org.codehaus.plexus.velocity.ContextClassLoaderResourceLoader'.
[INFO] Setting property: velocimacro.messages.on => 'false'.
[INFO] Setting property: resource.loader => 'classpath'.
[INFO] Setting property: resource.manager.logwhenfound => 'false'.
[INFO] 
[INFO] --- maven-xrts-plugin:1.2.6:generate-test-sources (default) @ trinidad ---
[INFO] 
[INFO] --- maven-xrts-plugin:1.2.6:generate-sources (default) @ trinidad ---
[JENKINS] Archiving <https://builds.apache.org/job/myfaces-trinidad-core-1.0/ws/pom.xml>
to /home/hudson/hudson/jobs/myfaces-trinidad-core-1.0/modules/org.apache.myfaces.trinidad$trinidad/builds/2012-01-12_07-25-41/archive/org.apache.myfaces.trinidad/trinidad/1.0.14-SNAPSHOT/trinidad-1.0.14-SNAPSHOT.pom
Jan 12, 2012 7:26:25 AM hudson.maven.ExecutedMojo <init>
WARNING: Failed to getClass for org.apache.maven.plugin.source.SourceJarMojo
[INFO] 
[INFO] --- maven-source-plugin:2.1.2:jar (attach-source) @ trinidad ---
[INFO] 
[INFO] --- maven-install-plugin:2.3:install (default-install) @ trinidad ---
[INFO] Installing <https://builds.apache.org/job/myfaces-trinidad-core-1.0/ws/pom.xml>
to /home/jenkins/.m2/repository/org/apache/myfaces/trinidad/trinidad/1.0.14-SNAPSHOT/trinidad-1.0.14-SNAPSHOT.pom
[INFO] 
[INFO] --- maven-xrts-plugin:1.2.6:generate-sources (default) @ trinidad ---
[INFO] 
[INFO] --- maven-remote-resources-plugin:1.0-alpha-6:process (default) @ trinidad ---
[INFO] 
[INFO] --- maven-xrts-plugin:1.2.6:generate-test-sources (default) @ trinidad ---
[INFO] 
[INFO] --- maven-xrts-plugin:1.2.6:generate-sources (default) @ trinidad ---
Jan 12, 2012 7:26:29 AM hudson.maven.ExecutedMojo <init>
WARNING: Failed to getClass for org.apache.maven.plugin.source.SourceJarMojo
[INFO] 
[INFO] --- maven-source-plugin:2.1.2:jar (attach-source) @ trinidad ---
[INFO] [INFO] Installing <https://builds.apache.org/job/myfaces-trinidad-core-1.0/ws/pom.xml>
to /home/jenkins/.m2/repository/org/apache/myfaces/trinidad/trinidad/1.0.14-SNAPSHOT/trinidad-1.0.14-SNAPSHOT.pom

[INFO] --- maven-install-plugin:2.3:install (default-install) @ trinidad ---
[INFO] Downloading: https://repository.apache.org/content/repositories/snapshots/org/apache/myfaces/trinidad/trinidad/1.0.14-SNAPSHOT/maven-metadata.xml

[INFO] --- maven-deploy-plugin:2.5:deploy (default-deploy) @ trinidad ---
[WARNING] Could not transfer metadata org.apache.myfaces.trinidad:trinidad:1.0.14-SNAPSHOT/maven-metadata.xml
from/to apache.snapshots.https (https://repository.apache.org/content/repositories/snapshots):
Error transferring file: Connection timed out
[INFO] ------------------------------------------------------------------------
[INFO] Reactor Summary:
[INFO] 
[INFO] Apache MyFaces Trinidad ........................... FAILURE [57.863s]
[INFO] Apache MyFaces Trinidad Build ..................... SKIPPED
[INFO] Apache MyFaces Trinidad API ....................... SKIPPED
[INFO] Apache MyFaces Trinidad Impl ...................... SKIPPED
[INFO] Apache MyFaces Trinidad Examples .................. SKIPPED
[INFO] Apache MyFaces Trinidad Blank Demo ................ SKIPPED
[INFO] Apache MyFaces Trinidad Demo ...................... SKIPPED
[INFO] ------------------------------------------------------------------------
[INFO] BUILD FAILURE
[INFO] ------------------------------------------------------------------------
[INFO] Total time: 58.681s
[INFO] Finished at: Thu Jan 12 07:26:51 UTC 2012
[INFO] Final Memory: 11M/155M
[INFO] ------------------------------------------------------------------------
mavenExecutionResult exceptions not empty
message : Failed to execute goal org.apache.maven.plugins:maven-deploy-plugin:2.5:deploy (default-deploy)
on project trinidad: Failed to retrieve remote metadata org.apache.myfaces.trinidad:trinidad:1.0.14-SNAPSHOT/maven-metadata.xml:
Could not transfer metadata org.apache.myfaces.trinidad:trinidad:1.0.14-SNAPSHOT/maven-metadata.xml
from/to apache.snapshots.https (https://repository.apache.org/content/repositories/snapshots):
Error transferring file: Connection timed out
cause : Failed to retrieve remote metadata org.apache.myfaces.trinidad:trinidad:1.0.14-SNAPSHOT/maven-metadata.xml:
Could not transfer metadata org.apache.myfaces.trinidad:trinidad:1.0.14-SNAPSHOT/maven-metadata.xml
from/to apache.snapshots.https (https://repository.apache.org/content/repositories/snapshots):
Error transferring file: Connection timed out
Stack trace : 
org.apache.maven.lifecycle.LifecycleExecutionException: Failed to execute goal org.apache.maven.plugins:maven-deploy-plugin:2.5:deploy
(default-deploy) on project trinidad: Failed to retrieve remote metadata org.apache.myfaces.trinidad:trinidad:1.0.14-SNAPSHOT/maven-metadata.xml:
Could not transfer metadata org.apache.myfaces.trinidad:trinidad:1.0.14-SNAPSHOT/maven-metadata.xml
from/to apache.snapshots.https (https://repository.apache.org/content/repositories/snapshots):
Error transferring file: Connection timed out
	at org.apache.maven.lifecycle.internal.MojoExecutor.execute(MojoExecutor.java:217)
	at org.apache.maven.lifecycle.internal.MojoExecutor.execute(MojoExecutor.java:153)
	at org.apache.maven.lifecycle.internal.MojoExecutor.execute(MojoExecutor.java:145)
	at org.apache.maven.lifecycle.internal.LifecycleModuleBuilder.buildProject(LifecycleModuleBuilder.java:84)
	at org.apache.maven.lifecycle.internal.LifecycleModuleBuilder.buildProject(LifecycleModuleBuilder.java:59)
	at org.apache.maven.lifecycle.internal.LifecycleStarter.singleThreadedBuild(LifecycleStarter.java:183)
	at org.apache.maven.lifecycle.internal.LifecycleStarter.execute(LifecycleStarter.java:161)
	at org.apache.maven.DefaultMaven.doExecute(DefaultMaven.java:319)
	at org.apache.maven.DefaultMaven.execute(DefaultMaven.java:156)
	at org.jvnet.hudson.maven3.launcher.Maven3Launcher.main(Maven3Launcher.java:79)
	at sun.reflect.NativeMethodAccessorImpl.invoke0(Native Method)
	at sun.reflect.NativeMethodAccessorImpl.invoke(NativeMethodAccessorImpl.java:39)
	at sun.reflect.DelegatingMethodAccessorImpl.invoke(DelegatingMethodAccessorImpl.java:25)
	at java.lang.reflect.Method.invoke(Method.java:592)
	at org.codehaus.plexus.classworlds.launcher.Launcher.launchStandard(Launcher.java:329)
	at org.codehaus.plexus.classworlds.launcher.Launcher.launch(Launcher.java:239)
	at org.jvnet.hudson.maven3.agent.Maven3Main.launch(Maven3Main.java:158)
	at hudson.maven.Maven3Builder.call(Maven3Builder.java:104)
	at hudson.maven.Maven3Builder.call(Maven3Builder.java:70)
	at hudson.remoting.UserRequest.perform(UserRequest.java:118)
	at hudson.remoting.UserRequest.perform(UserRequest.java:48)
	at hudson.remoting.Request$2.run(Request.java:287)
	at java.util.concurrent.Executors$RunnableAdapter.call(Executors.java:417)
	at java.util.concurrent.FutureTask$Sync.innerRun(FutureTask.java:269)
	at java.util.concurrent.FutureTask.run(FutureTask.java:123)
	at java.util.concurrent.ThreadPoolExecutor$Worker.runTask(ThreadPoolExecutor.java:651)
	at java.util.concurrent.ThreadPoolExecutor$Worker.run(ThreadPoolExecutor.java:676)
	at java.lang.Thread.run(Thread.java:595)
Caused by: org.apache.maven.plugin.MojoExecutionException: Failed to retrieve remote metadata
org.apache.myfaces.trinidad:trinidad:1.0.14-SNAPSHOT/maven-metadata.xml: Could not transfer
metadata org.apache.myfaces.trinidad:trinidad:1.0.14-SNAPSHOT/maven-metadata.xml from/to apache.snapshots.https
(https://repository.apache.org/content/repositories/snapshots): Error transferring file: Connection
timed out
	at org.apache.maven.plugin.deploy.DeployMojo.execute(DeployMojo.java:189)
	at org.apache.maven.plugin.DefaultBuildPluginManager.executeMojo(DefaultBuildPluginManager.java:101)
	at org.apache.maven.lifecycle.internal.MojoExecutor.execute(MojoExecutor.java:209)
	... 27 more
Caused by: org.apache.maven.artifact.deployer.ArtifactDeploymentException: Failed to retrieve
remote metadata org.apache.myfaces.trinidad:trinidad:1.0.14-SNAPSHOT/maven-metadata.xml: Could
not transfer metadata org.apache.myfaces.trinidad:trinidad:1.0.14-SNAPSHOT/maven-metadata.xml
from/to apache.snapshots.https (https://repository.apache.org/content/repositories/snapshots):
Error transferring file: Connection timed out
	at org.apache.maven.artifact.deployer.DefaultArtifactDeployer.deploy(DefaultArtifactDeployer.java:141)
	at org.apache.maven.plugin.deploy.DeployMojo.execute(DeployMojo.java:148)
	... 29 more
Caused by: org.sonatype.aether.deployment.DeploymentException: Failed to retrieve remote metadata
org.apache.myfaces.trinidad:trinidad:1.0.14-SNAPSHOT/maven-metadata.xml: Could not transfer
metadata org.apache.myfaces.trinidad:trinidad:1.0.14-SNAPSHOT/maven-metadata.xml from/to apache.snapshots.https
(https://repository.apache.org/content/repositories/snapshots): Error transferring file: Connection
timed out
	at org.sonatype.aether.impl.internal.DefaultDeployer.upload(DefaultDeployer.java:407)
	at org.sonatype.aether.impl.internal.DefaultDeployer.deploy(DefaultDeployer.java:260)
	at org.sonatype.aether.impl.internal.DefaultDeployer.deploy(DefaultDeployer.java:215)
	at org.sonatype.aether.impl.internal.DefaultRepositorySystem.deploy(DefaultRepositorySystem.java:480)
	at org.apache.maven.artifact.deployer.DefaultArtifactDeployer.deploy(DefaultArtifactDeployer.java:137)
	... 30 more
Caused by: org.sonatype.aether.transfer.MetadataTransferException: Could not transfer metadata
org.apache.myfaces.trinidad:trinidad:1.0.14-SNAPSHOT/maven-metadata.xml from/to apache.snapshots.https
(https://repository.apache.org/content/repositories/snapshots): Error transferring file: Connection
timed out
	at org.sonatype.aether.connector.wagon.WagonRepositoryConnector$3.wrap(WagonRepositoryConnector.java:932)
	at org.sonatype.aether.connector.wagon.WagonRepositoryConnector$3.wrap(WagonRepositoryConnector.java:923)
	at org.sonatype.aether.connector.wagon.WagonRepositoryConnector$GetTask.flush(WagonRepositoryConnector.java:695)
	at org.sonatype.aether.connector.wagon.WagonRepositoryConnector$GetTask.flush(WagonRepositoryConnector.java:689)
	at org.sonatype.aether.connector.wagon.WagonRepositoryConnector.get(WagonRepositoryConnector.java:445)
	at org.sonatype.aether.impl.internal.DefaultDeployer.upload(DefaultDeployer.java:379)
	... 34 more
Caused by: org.apache.maven.wagon.TransferFailedException: Error transferring file: Connection
timed out
	at org.apache.maven.wagon.providers.http.LightweightHttpWagon.fillInputData(LightweightHttpWagon.java:143)
	at org.apache.maven.wagon.StreamWagon.getInputStream(StreamWagon.java:116)
	at org.apache.maven.wagon.StreamWagon.getIfNewer(StreamWagon.java:88)
	at org.apache.maven.wagon.StreamWagon.get(StreamWagon.java:61)
	at org.sonatype.aether.connector.wagon.WagonRepositoryConnector$GetTask.run(WagonRepositoryConnector.java:608)
	at org.sonatype.aether.util.concurrency.RunnableErrorForwarder$1.run(RunnableErrorForwarder.java:64)
	... 3 more
Caused by: java.net.ConnectException: Connection timed out
	at java.net.PlainSocketImpl.socketConnect(Native Method)
	at java.net.PlainSocketImpl.doConnect(PlainSocketImpl.java:333)
	at java.net.PlainSocketImpl.connectToAddress(PlainSocketImpl.java:195)
	at java.net.PlainSocketImpl.connect(PlainSocketImpl.java:182)
	at java.net.Socket.connect(Socket.java:524)
	at java.net.Socket.connect(Socket.java:474)
	at sun.net.NetworkClient.doConnect(NetworkClient.java:157)
	at sun.net.www.http.HttpClient.openServer(HttpClient.java:388)
	at sun.net.www.http.HttpClient.openServer(HttpClient.java:523)
	at sun.net.www.protocol.https.HttpsClient.<init>(HttpsClient.java:278)
	at sun.net.www.protocol.https.HttpsClient.New(HttpsClient.java:335)
	at sun.net.www.protocol.https.AbstractDelegateHttpsURLConnection.getNewHttpClient(AbstractDelegateHttpsURLConnection.java:172)
	at sun.net.www.protocol.http.HttpURLConnection.plainConnect(HttpURLConnection.java:791)
	at sun.net.www.protocol.https.AbstractDelegateHttpsURLConnection.connect(AbstractDelegateHttpsURLConnection.java:158)
	at sun.net.www.protocol.http.HttpURLConnection.getInputStream(HttpURLConnection.java:960)
	at java.net.HttpURLConnection.getResponseCode(HttpURLConnection.java:367)
	at sun.net.www.protocol.https.HttpsURLConnectionImpl.getResponseCode(HttpsURLConnectionImpl.java:318)
	at org.apache.maven.wagon.providers.http.LightweightHttpWagon.fillInputData(LightweightHttpWagon.java:115)
	... 8 more
channel stopped


Mime
View raw message