myfaces-commits mailing list archives

Site index · List index
Message view « Date » · « Thread »
Top « Date » · « Thread »
From Apache Jenkins Server <jenk...@builds.apache.org>
Subject Build failed in Jenkins: myfaces-trinidad-core-1.0 #483
Date Thu, 10 Nov 2011 04:32:16 GMT
See <https://builds.apache.org/job/myfaces-trinidad-core-1.0/483/>

------------------------------------------
[...truncated 6293 lines...]
Uploading: https://repository.apache.org/content/repositories/snapshots/org/apache/myfaces/trinidad/trinidad-blank/1.0.14-SNAPSHOT/trinidad-blank-1.0.14-20111110.043117-722.pom
Uploaded: https://repository.apache.org/content/repositories/snapshots/org/apache/myfaces/trinidad/trinidad-blank/1.0.14-SNAPSHOT/trinidad-blank-1.0.14-20111110.043117-722.pom
(3 KB at 6.5 KB/sec)
Downloading: https://repository.apache.org/content/repositories/snapshots/org/apache/myfaces/trinidad/trinidad-blank/maven-metadata.xml
Downloaded: https://repository.apache.org/content/repositories/snapshots/org/apache/myfaces/trinidad/trinidad-blank/maven-metadata.xml
(615 B at 5.5 KB/sec)
Uploading: https://repository.apache.org/content/repositories/snapshots/org/apache/myfaces/trinidad/trinidad-blank/1.0.14-SNAPSHOT/maven-metadata.xml
Uploaded: https://repository.apache.org/content/repositories/snapshots/org/apache/myfaces/trinidad/trinidad-blank/1.0.14-SNAPSHOT/maven-metadata.xml
(1017 B at 3.4 KB/sec)
Uploading: https://repository.apache.org/content/repositories/snapshots/org/apache/myfaces/trinidad/trinidad-blank/maven-metadata.xml
Uploaded: https://repository.apache.org/content/repositories/snapshots/org/apache/myfaces/trinidad/trinidad-blank/maven-metadata.xml
(615 B at 5.9 KB/sec)
Uploading: https://repository.apache.org/content/repositories/snapshots/org/apache/myfaces/trinidad/trinidad-blank/1.0.14-SNAPSHOT/trinidad-blank-1.0.14-20111110.043117-722-sources.jar
Uploaded: https://repository.apache.org/content/repositories/snapshots/org/apache/myfaces/trinidad/trinidad-blank/1.0.14-SNAPSHOT/trinidad-blank-1.0.14-20111110.043117-722-sources.jar
(7 KB at 30.9 KB/sec)
Uploading: https://repository.apache.org/content/repositories/snapshots/org/apache/myfaces/trinidad/trinidad-blank/1.0.14-SNAPSHOT/maven-metadata.xml
Uploaded: https://repository.apache.org/content/repositories/snapshots/org/apache/myfaces/trinidad/trinidad-blank/1.0.14-SNAPSHOT/maven-metadata.xml
(1017 B at 9.9 KB/sec)
[JENKINS] Archiving <https://builds.apache.org/job/myfaces-trinidad-core-1.0/ws/trinidad-examples/trinidad-blank/target/trinidad-blank-1.0.14-SNAPSHOT.war>
to /home/hudson/hudson/jobs/myfaces-trinidad-core-1.0/modules/org.apache.myfaces.trinidad$trinidad-blank/builds/2011-11-10_04-27-47/archive/org.apache.myfaces.trinidad/trinidad-blank/1.0.14-20111110.043117-722/trinidad-blank-1.0.14-20111110.043117-722.war
[JENKINS] Archiving <https://builds.apache.org/job/myfaces-trinidad-core-1.0/ws/trinidad-examples/trinidad-blank/target/trinidad-blank-1.0.14-SNAPSHOT-sources.jar>
to /home/hudson/hudson/jobs/myfaces-trinidad-core-1.0/modules/org.apache.myfaces.trinidad$trinidad-blank/builds/2011-11-10_04-27-47/archive/org.apache.myfaces.trinidad/trinidad-blank/1.0.14-20111110.043117-722/trinidad-blank-1.0.14-20111110.043117-722-sources.jar
[INFO]                                                                         
[INFO] ------------------------------------------------------------------------
[INFO] Building Apache MyFaces Trinidad Demo 1.0.14-SNAPSHOT
[INFO] ------------------------------------------------------------------------
[INFO] [INFO] Deleting file set: <https://builds.apache.org/job/myfaces-trinidad-core-1.0/ws/trinidad-examples/trinidad-demo/target>
(included: [**], excluded: [])

[INFO] --- maven-clean-plugin:2.3:clean (default-clean) @ trinidad-demo ---
[INFO] 
[INFO] --- maven-xrts-plugin:1.2.6:generate-sources (default) @ trinidad-demo ---
[INFO] 
[INFO] --- maven-remote-resources-plugin:1.0-alpha-6:process (default) @ trinidad-demo ---
[INFO] [INFO] Using 'UTF-8' encoding to copy filtered resources.
[INFO] Copying 0 resource
[INFO] Copying 2 resources

[INFO] --- maven-resources-plugin:2.4.3:resources (default-resources) @ trinidad-demo ---
[INFO] 
[INFO] --- maven-compiler-plugin:2.3.1:compile (default-compile) @ trinidad-demo ---
[INFO] Compiling 85 source files to <https://builds.apache.org/job/myfaces-trinidad-core-1.0/ws/trinidad-examples/trinidad-demo/target/classes>
[INFO] 
[INFO] --- maven-xrts-plugin:1.2.6:generate-test-sources (default) @ trinidad-demo ---
[INFO] [INFO] Using 'UTF-8' encoding to copy filtered resources.
[INFO] skip non existing resourceDirectory <https://builds.apache.org/job/myfaces-trinidad-core-1.0/ws/trinidad-examples/trinidad-demo/src/test/resources>
[INFO] Copying 2 resources

[INFO] --- maven-resources-plugin:2.4.3:testResources (default-testResources) @ trinidad-demo
---
[INFO] 
[INFO] --- maven-compiler-plugin:2.3.1:testCompile (default-testCompile) @ trinidad-demo ---
[INFO] Compiling 5 source files to <https://builds.apache.org/job/myfaces-trinidad-core-1.0/ws/trinidad-examples/trinidad-demo/target/test-classes>
[INFO] 
[INFO] [INFO] Surefire report directory: <https://builds.apache.org/job/myfaces-trinidad-core-1.0/ws/trinidad-examples/trinidad-demo/target/surefire-reports>
--- maven-surefire-plugin:2.5:test (default-test) @ trinidad-demo ---

-------------------------------------------------------
 T E S T S
-------------------------------------------------------
There are no tests to run.

Results :

Tests run: 0, Failures: 0, Errors: 0, Skipped: 0

[JENKINS] Recording test results
[INFO] [INFO] Packaging webapp
[INFO] Assembling webapp [trinidad-demo] in [<https://builds.apache.org/job/myfaces-trinidad-core-1.0/ws/trinidad-examples/trinidad-demo/target/trinidad-demo-1.0.14-SNAPSHOT]>

[INFO] [INFO] Processing war project
[INFO] Copying webapp resources [<https://builds.apache.org/job/myfaces-trinidad-core-1.0/ws/trinidad-examples/trinidad-demo/src/main/webapp]>
--- maven-war-plugin:2.1.1:war (default-war) @ trinidad-demo ---
[INFO] Webapp assembled in [647 msecs]
[INFO] Building war: <https://builds.apache.org/job/myfaces-trinidad-core-1.0/ws/trinidad-examples/trinidad-demo/target/trinidad-demo-1.0.14-SNAPSHOT.war>
[INFO] WEB-INF/web.xml already added, skipping
[INFO] 
[INFO] --- maven-xrts-plugin:1.2.6:generate-sources (default) @ trinidad-demo ---
[JENKINS] Archiving <https://builds.apache.org/job/myfaces-trinidad-core-1.0/ws/trinidad-examples/trinidad-demo/pom.xml>
to /home/hudson/hudson/jobs/myfaces-trinidad-core-1.0/modules/org.apache.myfaces.trinidad$trinidad-demo/builds/2011-11-10_04-27-47/archive/org.apache.myfaces.trinidad/trinidad-demo/1.0.14-SNAPSHOT/trinidad-demo-1.0.14-SNAPSHOT.pom
[JENKINS] Archiving <https://builds.apache.org/job/myfaces-trinidad-core-1.0/ws/trinidad-examples/trinidad-demo/target/trinidad-demo-1.0.14-SNAPSHOT.war>
to /home/hudson/hudson/jobs/myfaces-trinidad-core-1.0/modules/org.apache.myfaces.trinidad$trinidad-demo/builds/2011-11-10_04-27-47/archive/org.apache.myfaces.trinidad/trinidad-demo/1.0.14-SNAPSHOT/trinidad-demo-1.0.14-SNAPSHOT.war
ignoring exception during new ExecutedMojo null
[INFO] 
[INFO] --- maven-source-plugin:2.1.2:jar (attach-source) @ trinidad-demo ---
[INFO] META-INF already added, skipping
[INFO] META-INF already added, skipping
[INFO] META-INF/NOTICE already added, skipping
[INFO] META-INF/LICENSE already added, skipping
[INFO] Building jar: <https://builds.apache.org/job/myfaces-trinidad-core-1.0/ws/trinidad-examples/trinidad-demo/target/trinidad-demo-1.0.14-SNAPSHOT-sources.jar>
[INFO] META-INF already added, skipping
[INFO] META-INF already added, skipping
[INFO] META-INF/NOTICE already added, skipping
[INFO] META-INF/LICENSE already added, skipping
[INFO] [INFO] Installing <https://builds.apache.org/job/myfaces-trinidad-core-1.0/ws/trinidad-examples/trinidad-demo/target/trinidad-demo-1.0.14-SNAPSHOT.war>
to /home/jenkins/.m2/repository/org/apache/myfaces/trinidad/trinidad-demo/1.0.14-SNAPSHOT/trinidad-demo-1.0.14-SNAPSHOT.war

[INFO] --- maven-install-plugin:2.3:install (default-install) @ trinidad-demo ---
[INFO] Installing <https://builds.apache.org/job/myfaces-trinidad-core-1.0/ws/trinidad-examples/trinidad-demo/pom.xml>
to /home/jenkins/.m2/repository/org/apache/myfaces/trinidad/trinidad-demo/1.0.14-SNAPSHOT/trinidad-demo-1.0.14-SNAPSHOT.pom
[INFO] Installing <https://builds.apache.org/job/myfaces-trinidad-core-1.0/ws/trinidad-examples/trinidad-demo/target/trinidad-demo-1.0.14-SNAPSHOT-sources.jar>
to /home/jenkins/.m2/repository/org/apache/myfaces/trinidad/trinidad-demo/1.0.14-SNAPSHOT/trinidad-demo-1.0.14-SNAPSHOT-sources.jar
[INFO] 
[INFO] --- maven-xrts-plugin:1.2.6:generate-sources (default) @ trinidad-demo ---
[INFO] 
[INFO] --- maven-remote-resources-plugin:1.0-alpha-6:process (default) @ trinidad-demo ---
[INFO] [INFO] Using 'UTF-8' encoding to copy filtered resources.
[INFO] Copying 0 resource

[INFO] Copying 2 resources
[INFO] [INFO] Copying 2 resources
--- maven-resources-plugin:2.4.3:resources (default-resources) @ trinidad-demo ---
[INFO] 
[INFO] --- maven-compiler-plugin:2.3.1:compile (default-compile) @ trinidad-demo ---
[INFO] Nothing to compile - all classes are up to date
[INFO] 
[INFO] --- maven-xrts-plugin:1.2.6:generate-test-sources (default) @ trinidad-demo ---
[INFO] [INFO] Using 'UTF-8' encoding to copy filtered resources.
[INFO] skip non existing resourceDirectory <https://builds.apache.org/job/myfaces-trinidad-core-1.0/ws/trinidad-examples/trinidad-demo/src/test/resources>
[INFO] Copying 2 resources
[INFO] Copying 2 resources

[INFO] --- maven-resources-plugin:2.4.3:testResources (default-testResources) @ trinidad-demo
---
[INFO] 
[INFO] --- maven-compiler-plugin:2.3.1:testCompile (default-testCompile) @ trinidad-demo ---
[INFO] Nothing to compile - all classes are up to date
[INFO] 
[INFO] [INFO] Surefire report directory: <https://builds.apache.org/job/myfaces-trinidad-core-1.0/ws/trinidad-examples/trinidad-demo/target/surefire-reports>
--- maven-surefire-plugin:2.5:test (default-test) @ trinidad-demo ---

-------------------------------------------------------
 T E S T S
-------------------------------------------------------
There are no tests to run.

Results :

Tests run: 0, Failures: 0, Errors: 0, Skipped: 0

[JENKINS] Recording test results
[INFO] [INFO] Packaging webapp
[INFO] Assembling webapp [trinidad-demo] in [<https://builds.apache.org/job/myfaces-trinidad-core-1.0/ws/trinidad-examples/trinidad-demo/target/trinidad-demo-1.0.14-SNAPSHOT]>
[INFO] Processing war project

[INFO] Copying webapp resources [<https://builds.apache.org/job/myfaces-trinidad-core-1.0/ws/trinidad-examples/trinidad-demo/src/main/webapp]>
[INFO] --- maven-war-plugin:2.1.1:war (default-war) @ trinidad-demo ---
[INFO] Webapp assembled in [258 msecs]
[INFO] Building war: <https://builds.apache.org/job/myfaces-trinidad-core-1.0/ws/trinidad-examples/trinidad-demo/target/trinidad-demo-1.0.14-SNAPSHOT.war>
[INFO] WEB-INF/web.xml already added, skipping
[INFO] 
[INFO] --- maven-xrts-plugin:1.2.6:generate-sources (default) @ trinidad-demo ---
[JENKINS] Re-archiving <https://builds.apache.org/job/myfaces-trinidad-core-1.0/ws/trinidad-examples/trinidad-demo/target/trinidad-demo-1.0.14-SNAPSHOT.war>
[JENKINS] Archiving <https://builds.apache.org/job/myfaces-trinidad-core-1.0/ws/trinidad-examples/trinidad-demo/target/trinidad-demo-1.0.14-SNAPSHOT-sources.jar>
to /home/hudson/hudson/jobs/myfaces-trinidad-core-1.0/modules/org.apache.myfaces.trinidad$trinidad-demo/builds/2011-11-10_04-27-47/archive/org.apache.myfaces.trinidad/trinidad-demo/1.0.14-SNAPSHOT/trinidad-demo-1.0.14-SNAPSHOT-sources.jar
ignoring exception during new ExecutedMojo null
[INFO] 
[INFO] --- maven-source-plugin:2.1.2:jar (attach-source) @ trinidad-demo ---
[INFO] META-INF already added, skipping
[INFO] META-INF/NOTICE already added, skipping
[INFO] META-INF/LICENSE already added, skipping
[INFO] META-INF already added, skipping
[INFO] META-INF already added, skipping
[INFO] META-INF/NOTICE already added, skipping
[INFO] META-INF/LICENSE already added, skipping
[INFO] META-INF already added, skipping
[INFO] META-INF/NOTICE already added, skipping
[INFO] META-INF/LICENSE already added, skipping
[INFO] Building jar: <https://builds.apache.org/job/myfaces-trinidad-core-1.0/ws/trinidad-examples/trinidad-demo/target/trinidad-demo-1.0.14-SNAPSHOT-sources.jar>
[INFO] META-INF already added, skipping
[INFO] META-INF/NOTICE already added, skipping
[INFO] META-INF/LICENSE already added, skipping
[INFO] META-INF already added, skipping
[INFO] META-INF already added, skipping
[INFO] META-INF/NOTICE already added, skipping
[INFO] META-INF/LICENSE already added, skipping
[INFO] META-INF already added, skipping
[INFO] META-INF/NOTICE already added, skipping
[INFO] META-INF/LICENSE already added, skipping
[WARNING] Artifact org.apache.myfaces.trinidad:trinidad-demo:java-source:sources:1.0.14-SNAPSHOT
already attached to project, ignoring duplicate
[INFO] [INFO] Installing <https://builds.apache.org/job/myfaces-trinidad-core-1.0/ws/trinidad-examples/trinidad-demo/target/trinidad-demo-1.0.14-SNAPSHOT.war>
to /home/jenkins/.m2/repository/org/apache/myfaces/trinidad/trinidad-demo/1.0.14-SNAPSHOT/trinidad-demo-1.0.14-SNAPSHOT.war
[INFO] Installing <https://builds.apache.org/job/myfaces-trinidad-core-1.0/ws/trinidad-examples/trinidad-demo/pom.xml>
to /home/jenkins/.m2/repository/org/apache/myfaces/trinidad/trinidad-demo/1.0.14-SNAPSHOT/trinidad-demo-1.0.14-SNAPSHOT.pom

[INFO] --- maven-install-plugin:2.3:install (default-install) @ trinidad-demo ---[INFO] Installing
<https://builds.apache.org/job/myfaces-trinidad-core-1.0/ws/trinidad-examples/trinidad-demo/target/trinidad-demo-1.0.14-SNAPSHOT-sources.jar>
to /home/jenkins/.m2/repository/org/apache/myfaces/trinidad/trinidad-demo/1.0.14-SNAPSHOT/trinidad-demo-1.0.14-SNAPSHOT-sources.jar

[INFO] Downloading: https://repository.apache.org/content/repositories/snapshots/org/apache/myfaces/trinidad/trinidad-demo/1.0.14-SNAPSHOT/maven-metadata.xml

[INFO] --- maven-deploy-plugin:2.5:deploy (default-deploy) @ trinidad-demo ---
Downloaded: https://repository.apache.org/content/repositories/snapshots/org/apache/myfaces/trinidad/trinidad-demo/1.0.14-SNAPSHOT/maven-metadata.xml
(1016 B at 2.4 KB/sec)
Uploading: https://repository.apache.org/content/repositories/snapshots/org/apache/myfaces/trinidad/trinidad-demo/1.0.14-SNAPSHOT/trinidad-demo-1.0.14-20111110.043201-716.war
Uploaded: https://repository.apache.org/content/repositories/snapshots/org/apache/myfaces/trinidad/trinidad-demo/1.0.14-SNAPSHOT/trinidad-demo-1.0.14-20111110.043201-716.war
(7938 KB at 4998.6 KB/sec)
Uploading: https://repository.apache.org/content/repositories/snapshots/org/apache/myfaces/trinidad/trinidad-demo/1.0.14-SNAPSHOT/trinidad-demo-1.0.14-20111110.043201-716.pom
Uploaded: https://repository.apache.org/content/repositories/snapshots/org/apache/myfaces/trinidad/trinidad-demo/1.0.14-SNAPSHOT/trinidad-demo-1.0.14-20111110.043201-716.pom
(3 KB at 1.8 KB/sec)
Downloading: https://repository.apache.org/content/repositories/snapshots/org/apache/myfaces/trinidad/trinidad-demo/maven-metadata.xml
Downloaded: https://repository.apache.org/content/repositories/snapshots/org/apache/myfaces/trinidad/trinidad-demo/maven-metadata.xml
(7 KB at 61.5 KB/sec)
Uploading: https://repository.apache.org/content/repositories/snapshots/org/apache/myfaces/trinidad/trinidad-demo/1.0.14-SNAPSHOT/maven-metadata.xml
Uploaded: https://repository.apache.org/content/repositories/snapshots/org/apache/myfaces/trinidad/trinidad-demo/1.0.14-SNAPSHOT/maven-metadata.xml
(1016 B at 1.2 KB/sec)
Uploading: https://repository.apache.org/content/repositories/snapshots/org/apache/myfaces/trinidad/trinidad-demo/maven-metadata.xml
Uploaded: https://repository.apache.org/content/repositories/snapshots/org/apache/myfaces/trinidad/trinidad-demo/maven-metadata.xml
(7 KB at 16.2 KB/sec)
Uploading: https://repository.apache.org/content/repositories/snapshots/org/apache/myfaces/trinidad/trinidad-demo/1.0.14-SNAPSHOT/trinidad-demo-1.0.14-20111110.043201-716-sources.jar
Uploaded: https://repository.apache.org/content/repositories/snapshots/org/apache/myfaces/trinidad/trinidad-demo/1.0.14-SNAPSHOT/trinidad-demo-1.0.14-20111110.043201-716-sources.jar
(133 KB at 671.1 KB/sec)
Uploading: https://repository.apache.org/content/repositories/snapshots/org/apache/myfaces/trinidad/trinidad-demo/1.0.14-SNAPSHOT/maven-metadata.xml
Uploaded: https://repository.apache.org/content/repositories/snapshots/org/apache/myfaces/trinidad/trinidad-demo/1.0.14-SNAPSHOT/maven-metadata.xml
(1016 B at 4.8 KB/sec)
[JENKINS] Archiving <https://builds.apache.org/job/myfaces-trinidad-core-1.0/ws/trinidad-examples/trinidad-demo/target/trinidad-demo-1.0.14-SNAPSHOT.war>
to /home/hudson/hudson/jobs/myfaces-trinidad-core-1.0/modules/org.apache.myfaces.trinidad$trinidad-demo/builds/2011-11-10_04-27-47/archive/org.apache.myfaces.trinidad/trinidad-demo/1.0.14-20111110.043201-716/trinidad-demo-1.0.14-20111110.043201-716.war
[JENKINS] Archiving <https://builds.apache.org/job/myfaces-trinidad-core-1.0/ws/trinidad-examples/trinidad-demo/target/trinidad-demo-1.0.14-SNAPSHOT-sources.jar>
to /home/hudson/hudson/jobs/myfaces-trinidad-core-1.0/modules/org.apache.myfaces.trinidad$trinidad-demo/builds/2011-11-10_04-27-47/archive/org.apache.myfaces.trinidad/trinidad-demo/1.0.14-20111110.043201-716/trinidad-demo-1.0.14-20111110.043201-716-sources.jar
[INFO] ------------------------------------------------------------------------
[INFO] Reactor Summary:
[INFO] 
[INFO] Apache MyFaces Trinidad ........................... SUCCESS [7.855s]
[INFO] Apache MyFaces Trinidad Build ..................... SUCCESS [10.713s]
[INFO] Apache MyFaces Trinidad API ....................... SUCCESS [38.129s]
[INFO] Apache MyFaces Trinidad Impl ...................... SUCCESS [1:36.478s]
[INFO] Apache MyFaces Trinidad Examples .................. SUCCESS [3.233s]
[INFO] Apache MyFaces Trinidad Blank Demo ................ SUCCESS [33.064s]
[INFO] Apache MyFaces Trinidad Demo ...................... SUCCESS [36.878s]
[INFO] ------------------------------------------------------------------------
[INFO] BUILD SUCCESS
[INFO] ------------------------------------------------------------------------
[INFO] Total time: 4:24.639s
[INFO] Finished at: Thu Nov 10 04:32:15 UTC 2011
[INFO] Final Memory: 61M/549M
[INFO] ------------------------------------------------------------------------
channel stopped
Maven RedeployPublished use remote ubuntu3 maven settings from : /home/jenkins/.m2/settings.xml
[ERROR] uniqueVersion == false is not anymore supported in maven 3
[INFO] Deployment in https://repository.apache.org/content/repositories/snapshots (id=,uniqueVersion=false)
Deploying the main artifact trinidad-1.0.14-SNAPSHOT.pom
Downloading: https://repository.apache.org/content/repositories/snapshots/org/apache/myfaces/trinidad/trinidad/1.0.14-SNAPSHOT/maven-metadata.xml
Downloaded: https://repository.apache.org/content/repositories/snapshots/org/apache/myfaces/trinidad/trinidad/1.0.14-SNAPSHOT/maven-metadata.xml
(618 B at 7.4 KB/sec)
Uploading: https://repository.apache.org/content/repositories/snapshots/org/apache/myfaces/trinidad/trinidad/1.0.14-SNAPSHOT/trinidad-1.0.14-20111110.043216-764.pom
Uploading: https://repository.apache.org/content/repositories/snapshots/org/apache/myfaces/trinidad/trinidad/1.0.14-SNAPSHOT/trinidad-1.0.14-20111110.043216-764.pom
ERROR: Failed to deploy artifacts: Could not transfer artifact org.apache.myfaces.trinidad:trinidad:pom:1.0.14-20111110.043216-764
from/to  (https://repository.apache.org/content/repositories/snapshots): Failed to transfer
file: https://repository.apache.org/content/repositories/snapshots/org/apache/myfaces/trinidad/trinidad/1.0.14-SNAPSHOT/trinidad-1.0.14-20111110.043216-764.pom.
Return code is: 401
org.apache.maven.artifact.deployer.ArtifactDeploymentException: Failed to deploy artifacts:
Could not transfer artifact org.apache.myfaces.trinidad:trinidad:pom:1.0.14-20111110.043216-764
from/to  (https://repository.apache.org/content/repositories/snapshots): Failed to transfer
file: https://repository.apache.org/content/repositories/snapshots/org/apache/myfaces/trinidad/trinidad/1.0.14-SNAPSHOT/trinidad-1.0.14-20111110.043216-764.pom.
Return code is: 401
	at org.apache.maven.artifact.deployer.DefaultArtifactDeployer.deploy(DefaultArtifactDeployer.java:141)
	at hudson.maven.reporters.MavenArtifactRecord.deploy(MavenArtifactRecord.java:189)
	at hudson.maven.RedeployPublisher.perform(RedeployPublisher.java:158)
	at hudson.tasks.BuildStepMonitor$1.perform(BuildStepMonitor.java:19)
	at hudson.model.AbstractBuild$AbstractRunner.perform(AbstractBuild.java:693)
	at hudson.model.AbstractBuild$AbstractRunner.performAllBuildSteps(AbstractBuild.java:668)
	at hudson.maven.MavenModuleSetBuild$RunnerImpl.post2(MavenModuleSetBuild.java:953)
	at hudson.model.AbstractBuild$AbstractRunner.post(AbstractBuild.java:615)
	at hudson.model.Run.run(Run.java:1401)
	at hudson.maven.MavenModuleSetBuild.run(MavenModuleSetBuild.java:474)
	at hudson.model.ResourceController.execute(ResourceController.java:88)
	at hudson.model.Executor.run(Executor.java:230)
Caused by: org.sonatype.aether.deployment.DeploymentException: Failed to deploy artifacts:
Could not transfer artifact org.apache.myfaces.trinidad:trinidad:pom:1.0.14-20111110.043216-764
from/to  (https://repository.apache.org/content/repositories/snapshots): Failed to transfer
file: https://repository.apache.org/content/repositories/snapshots/org/apache/myfaces/trinidad/trinidad/1.0.14-SNAPSHOT/trinidad-1.0.14-20111110.043216-764.pom.
Return code is: 401
	at org.sonatype.aether.impl.internal.DefaultDeployer.deploy(DefaultDeployer.java:284)
	at org.sonatype.aether.impl.internal.DefaultDeployer.deploy(DefaultDeployer.java:215)
	at org.sonatype.aether.impl.internal.DefaultRepositorySystem.deploy(DefaultRepositorySystem.java:480)
	at org.apache.maven.artifact.deployer.DefaultArtifactDeployer.deploy(DefaultArtifactDeployer.java:137)
	... 11 more
Caused by: org.sonatype.aether.transfer.ArtifactTransferException: Could not transfer artifact
org.apache.myfaces.trinidad:trinidad:pom:1.0.14-20111110.043216-764 from/to  (https://repository.apache.org/content/repositories/snapshots):
Failed to transfer file: https://repository.apache.org/content/repositories/snapshots/org/apache/myfaces/trinidad/trinidad/1.0.14-SNAPSHOT/trinidad-1.0.14-20111110.043216-764.pom.
Return code is: 401
	at org.sonatype.aether.connector.wagon.WagonRepositoryConnector$4.wrap(WagonRepositoryConnector.java:949)
	at org.sonatype.aether.connector.wagon.WagonRepositoryConnector$4.wrap(WagonRepositoryConnector.java:940)
	at org.sonatype.aether.connector.wagon.WagonRepositoryConnector$PutTask.flush(WagonRepositoryConnector.java:864)
	at org.sonatype.aether.connector.wagon.WagonRepositoryConnector.put(WagonRepositoryConnector.java:466)
	at org.sonatype.aether.impl.internal.DefaultDeployer.deploy(DefaultDeployer.java:278)
	... 14 more
Caused by: org.apache.maven.wagon.TransferFailedException: Failed to transfer file: https://repository.apache.org/content/repositories/snapshots/org/apache/myfaces/trinidad/trinidad/1.0.14-SNAPSHOT/trinidad-1.0.14-20111110.043216-764.pom.
Return code is: 401
	at org.apache.maven.wagon.shared.http.AbstractHttpClientWagon.put(AbstractHttpClientWagon.java:368)
	at org.apache.maven.wagon.shared.http.AbstractHttpClientWagon.put(AbstractHttpClientWagon.java:280)
	at org.sonatype.aether.connector.wagon.WagonRepositoryConnector$PutTask.run(WagonRepositoryConnector.java:825)
	at org.sonatype.aether.connector.wagon.WagonRepositoryConnector.put(WagonRepositoryConnector.java:465)
	... 15 more
[INFO] Deployment failed after 0.41 sec
Build step 'Deploy artifacts to Maven repository' changed build result to FAILURE


Mime
View raw message