myfaces-commits mailing list archives

Site index · List index
Message view « Date » · « Thread »
Top « Date » · « Thread »
From Apache Jenkins Server <jenk...@builds.apache.org>
Subject Build failed in Jenkins: myfaces-trinidad-core-2 #481
Date Tue, 04 Oct 2011 00:14:51 GMT
See <https://builds.apache.org/job/myfaces-trinidad-core-2/481/>

------------------------------------------
[...truncated 10799 lines...]
[INFO] META-INF/adf/jsLibsDebug/resources/LocaleElements_no_NO.js already added, skipping
[INFO] META-INF/adf/jsLibsDebug/resources/LocaleElements_pl.js already added, skipping
[INFO] META-INF/adf/jsLibsDebug/resources/LocaleElements_en_PH.js already added, skipping
[INFO] META-INF/adf/jsLibsDebug/resources/LocaleElements_en_NZ.js already added, skipping
[INFO] META-INF/adf/jsLibsDebug/resources/LocaleElements_ar_YE.js already added, skipping
[INFO] META-INF/adf/jsLibsDebug/resources/LocaleElements_ar_LB.js already added, skipping
[INFO] META-INF/adf/jsLibsDebug/resources/LocaleElements_be.js already added, skipping
[INFO] META-INF/adf/jsLibsDebug/resources/LocaleElements_sv.js already added, skipping
[INFO] META-INF/adf/jsLibsDebug/resources/LocaleElements_ro.js already added, skipping
[INFO] META-INF/adf/jsLibsDebug/resources/LocaleElements_lv_LV.js already added, skipping
[INFO] META-INF/adf/jsLibsDebug/resources/LocaleElements_cs_CZ.js already added, skipping
[INFO] META-INF/adf/jsLibsDebug/resources/LocaleElements_zh_SG.js already added, skipping
[INFO] META-INF/adf/jsLibsDebug/resources/LocaleElements_ar_OM.js already added, skipping
[INFO] META-INF/adf/jsLibsDebug/resources/LocaleElements_tr.js already added, skipping
[INFO] META-INF/adf/jsLibsDebug/resources/LocaleElements_en_AU.js already added, skipping
[INFO] META-INF/adf/jsLibsDebug/resources/LocaleElements_it_IT.js already added, skipping
[INFO] META-INF/adf/jsLibsDebug/resources/LocaleElements_es_PA.js already added, skipping
[INFO] META-INF/adf/jsLibsDebug/resources/LocaleElements_ga.js already added, skipping
[INFO] META-INF/adf/jsLibsDebug/resources/LocaleElements_fr_LU.js already added, skipping
[INFO] META-INF/adf/jsLibsDebug/resources/LocaleElements_zh.js already added, skipping
[INFO] META-INF/adf/jsLibsDebug/resources/LocaleElements_hi_IN.js already added, skipping
[INFO] META-INF/adf/jsLibsDebug/resources/LocaleElements_vi.js already added, skipping
[INFO] META-INF/adf/jsLibsDebug/resources/LocaleElements_es_BO.js already added, skipping
[INFO] META-INF/adf/jsLibsDebug/resources/LocaleElements_fi.js already added, skipping
[INFO] META-INF/adf/jsLibsDebug/resources/LocaleElements_no_NO_NY.js already added, skipping
[INFO] META-INF/adf/jsLibsDebug/resources/LocaleElements_el.js already added, skipping
[INFO] META-INF/adf/jsLibsDebug/resources/LocaleElements_ar_MA.js already added, skipping
[INFO] META-INF/adf/jsLibsDebug/resources/LocaleElements_sr_CS.js already added, skipping
[INFO] META-INF/adf/jsLibsDebug/resources/LocaleElements_ar_QA.js already added, skipping
[INFO] META-INF/adf/jsLibsDebug/resources/LocaleElements_es_DO.js already added, skipping
[INFO] META-INF/adf/jsLibsDebug/resources/LocaleElements_ru.js already added, skipping
[INFO] META-INF/adf/jsLibsDebug/resources/LocaleElements_ca_ES.js already added, skipping
[INFO] META-INF/adf/jsLibsDebug/resources/LocaleElements_ms_MY.js already added, skipping
[INFO] META-INF/adf/jsLibsDebug/PanelPopup.js already added, skipping
[INFO] META-INF/adf/jsLibsDebug/Window.js already added, skipping
[INFO] META-INF/adf/jsLibsDebug/StatusIndicator.js already added, skipping
[INFO] META-INF/adf/jsLibsDebug/TableProxy.js already added, skipping
[WARNING] Artifact org.apache.myfaces.trinidad:trinidad-impl:java-source:sources:2.0.2-SNAPSHOT
already attached to project, ignoring duplicate
[INFO] 
[INFO] --- maven-jar-plugin:2.3.1:test-jar (default) @ trinidad-impl ---
[INFO] Building jar: <https://builds.apache.org/job/myfaces-trinidad-core-2/ws/trinidad-impl/target/trinidad-impl-2.0.2-SNAPSHOT-tests.jar>
[WARNING] Artifact org.apache.myfaces.trinidad:trinidad-impl:test-jar:tests:2.0.2-SNAPSHOT
already attached to project, ignoring duplicate
[INFO] Installing <https://builds.apache.org/job/myfaces-trinidad-core-2/ws/trinidad-impl/target/trinidad-impl-2.0.2-SNAPSHOT.jar>
to /home/jenkins/.m2/repository/org/apache/myfaces/trinidad/trinidad-impl/2.0.2-SNAPSHOT/trinidad-impl-2.0.2-SNAPSHOT.jar
[INFO] [INFO] Installing <https://builds.apache.org/job/myfaces-trinidad-core-2/ws/trinidad-impl/pom.xml>
to /home/jenkins/.m2/repository/org/apache/myfaces/trinidad/trinidad-impl/2.0.2-SNAPSHOT/trinidad-impl-2.0.2-SNAPSHOT.pom
[INFO] Installing <https://builds.apache.org/job/myfaces-trinidad-core-2/ws/trinidad-impl/target/trinidad-impl-2.0.2-SNAPSHOT-sources.jar>
to /home/jenkins/.m2/repository/org/apache/myfaces/trinidad/trinidad-impl/2.0.2-SNAPSHOT/trinidad-impl-2.0.2-SNAPSHOT-sources.jar
[INFO] Installing <https://builds.apache.org/job/myfaces-trinidad-core-2/ws/trinidad-impl/target/trinidad-impl-2.0.2-SNAPSHOT-tests.jar>
to /home/jenkins/.m2/repository/org/apache/myfaces/trinidad/trinidad-impl/2.0.2-SNAPSHOT/trinidad-impl-2.0.2-SNAPSHOT-tests.jar

[INFO] --- maven-install-plugin:2.3:install (default-install) @ trinidad-impl ---
Downloading: https://repository.apache.org/content/repositories/snapshots/org/apache/myfaces/trinidad/trinidad-impl/2.0.2-SNAPSHOT/maven-metadata.xml
[INFO] 
[INFO] --- maven-deploy-plugin:2.5:deploy (default-deploy) @ trinidad-impl ---
Downloaded: https://repository.apache.org/content/repositories/snapshots/org/apache/myfaces/trinidad/trinidad-impl/2.0.2-SNAPSHOT/maven-metadata.xml
(2 KB at 2.7 KB/sec)
Uploading: https://repository.apache.org/content/repositories/snapshots/org/apache/myfaces/trinidad/trinidad-impl/2.0.2-SNAPSHOT/trinidad-impl-2.0.2-20111004.001321-24.jar
Uploaded: https://repository.apache.org/content/repositories/snapshots/org/apache/myfaces/trinidad/trinidad-impl/2.0.2-SNAPSHOT/trinidad-impl-2.0.2-20111004.001321-24.jar
(4848 KB at 3497.1 KB/sec)
Uploading: https://repository.apache.org/content/repositories/snapshots/org/apache/myfaces/trinidad/trinidad-impl/2.0.2-SNAPSHOT/trinidad-impl-2.0.2-20111004.001321-24.pom
Uploaded: https://repository.apache.org/content/repositories/snapshots/org/apache/myfaces/trinidad/trinidad-impl/2.0.2-SNAPSHOT/trinidad-impl-2.0.2-20111004.001321-24.pom
(14 KB at 82.9 KB/sec)
Downloading: https://repository.apache.org/content/repositories/snapshots/org/apache/myfaces/trinidad/trinidad-impl/maven-metadata.xml
Downloaded: https://repository.apache.org/content/repositories/snapshots/org/apache/myfaces/trinidad/trinidad-impl/maven-metadata.xml
(614 B at 7.1 KB/sec)
Uploading: https://repository.apache.org/content/repositories/snapshots/org/apache/myfaces/trinidad/trinidad-impl/2.0.2-SNAPSHOT/maven-metadata.xml
Uploaded: https://repository.apache.org/content/repositories/snapshots/org/apache/myfaces/trinidad/trinidad-impl/2.0.2-SNAPSHOT/maven-metadata.xml
(2 KB at 7.8 KB/sec)
Uploading: https://repository.apache.org/content/repositories/snapshots/org/apache/myfaces/trinidad/trinidad-impl/maven-metadata.xml
Uploaded: https://repository.apache.org/content/repositories/snapshots/org/apache/myfaces/trinidad/trinidad-impl/maven-metadata.xml
(614 B at 4.3 KB/sec)
Uploading: https://repository.apache.org/content/repositories/snapshots/org/apache/myfaces/trinidad/trinidad-impl/2.0.2-SNAPSHOT/trinidad-impl-2.0.2-20111004.001321-24-sources.jar
Uploaded: https://repository.apache.org/content/repositories/snapshots/org/apache/myfaces/trinidad/trinidad-impl/2.0.2-SNAPSHOT/trinidad-impl-2.0.2-20111004.001321-24-sources.jar
(4365 KB at 5646.7 KB/sec)
Uploading: https://repository.apache.org/content/repositories/snapshots/org/apache/myfaces/trinidad/trinidad-impl/2.0.2-SNAPSHOT/maven-metadata.xml
Uploaded: https://repository.apache.org/content/repositories/snapshots/org/apache/myfaces/trinidad/trinidad-impl/2.0.2-SNAPSHOT/maven-metadata.xml
(2 KB at 6.1 KB/sec)
Uploading: https://repository.apache.org/content/repositories/snapshots/org/apache/myfaces/trinidad/trinidad-impl/2.0.2-SNAPSHOT/trinidad-impl-2.0.2-20111004.001321-24-tests.jar
Uploaded: https://repository.apache.org/content/repositories/snapshots/org/apache/myfaces/trinidad/trinidad-impl/2.0.2-SNAPSHOT/trinidad-impl-2.0.2-20111004.001321-24-tests.jar
(1508 KB at 3723.1 KB/sec)
Uploading: https://repository.apache.org/content/repositories/snapshots/org/apache/myfaces/trinidad/trinidad-impl/2.0.2-SNAPSHOT/maven-metadata.xml
Uploaded: https://repository.apache.org/content/repositories/snapshots/org/apache/myfaces/trinidad/trinidad-impl/2.0.2-SNAPSHOT/maven-metadata.xml
(2 KB at 6.4 KB/sec)
[JENKINS] Archiving <https://builds.apache.org/job/myfaces-trinidad-core-2/ws/trinidad-impl/target/trinidad-impl-2.0.2-SNAPSHOT.jar>
to /home/hudson/hudson/jobs/myfaces-trinidad-core-2/modules/org.apache.myfaces.trinidad$trinidad-impl/builds/2011-10-04_00-06-32/archive/org.apache.myfaces.trinidad/trinidad-impl/2.0.2-20111004.001321-24/trinidad-impl-2.0.2-20111004.001321-24.jar
[JENKINS] Archiving <https://builds.apache.org/job/myfaces-trinidad-core-2/ws/trinidad-impl/target/trinidad-impl-2.0.2-SNAPSHOT-sources.jar>
to /home/hudson/hudson/jobs/myfaces-trinidad-core-2/modules/org.apache.myfaces.trinidad$trinidad-impl/builds/2011-10-04_00-06-32/archive/org.apache.myfaces.trinidad/trinidad-impl/2.0.2-20111004.001321-24/trinidad-impl-2.0.2-20111004.001321-24-sources.jar
[JENKINS] Archiving <https://builds.apache.org/job/myfaces-trinidad-core-2/ws/trinidad-impl/target/trinidad-impl-2.0.2-SNAPSHOT-tests.jar>
to /home/hudson/hudson/jobs/myfaces-trinidad-core-2/modules/org.apache.myfaces.trinidad$trinidad-impl/builds/2011-10-04_00-06-32/archive/org.apache.myfaces.trinidad/trinidad-impl/2.0.2-20111004.001321-24/trinidad-impl-2.0.2-20111004.001321-24-tests.jar
[INFO] [INFO] Deleting <https://builds.apache.org/job/myfaces-trinidad-core-2/ws/trinidad-examples/target>
                                                                        
[INFO] ------------------------------------------------------------------------
[INFO] Building Apache MyFaces Trinidad Examples 2.0.2-SNAPSHOT
[INFO] ------------------------------------------------------------------------
[INFO] 
[INFO] --- maven-clean-plugin:2.4.1:clean (default-clean) @ trinidad-example ---
[INFO] 
[INFO] --- maven-enforcer-plugin:1.0-beta-1:enforce (enforce-versions) @ trinidad-example
---
[INFO] 
[INFO] --- maven-xrts-plugin:2.0.6:generate-sources (default) @ trinidad-example ---
[INFO] 
[INFO] --- maven-remote-resources-plugin:1.0-alpha-6:process (default) @ trinidad-example
---
[INFO] 
[INFO] --- maven-xrts-plugin:2.0.6:generate-test-sources (default) @ trinidad-example ---
[INFO] 
[INFO] --- maven-enforcer-plugin:1.0-beta-1:enforce (enforce-versions) @ trinidad-example
---
[INFO] 
[INFO] --- maven-xrts-plugin:2.0.6:generate-sources (default) @ trinidad-example ---
[JENKINS] Archiving <https://builds.apache.org/job/myfaces-trinidad-core-2/ws/trinidad-examples/pom.xml>
to /home/hudson/hudson/jobs/myfaces-trinidad-core-2/modules/org.apache.myfaces.trinidad$trinidad-example/builds/2011-10-04_00-06-32/archive/org.apache.myfaces.trinidad/trinidad-example/2.0.2-SNAPSHOT/trinidad-example-2.0.2-SNAPSHOT.pom
ignoring exception during new ExecutedMojo null
[INFO] 
[INFO] --- maven-source-plugin:2.1.2:jar (attach-source) @ trinidad-example ---
[INFO] [INFO] Installing <https://builds.apache.org/job/myfaces-trinidad-core-2/ws/trinidad-examples/pom.xml>
to /home/jenkins/.m2/repository/org/apache/myfaces/trinidad/trinidad-example/2.0.2-SNAPSHOT/trinidad-example-2.0.2-SNAPSHOT.pom

[INFO] --- maven-install-plugin:2.3:install (default-install) @ trinidad-example ---
[INFO] 
[INFO] --- maven-enforcer-plugin:1.0-beta-1:enforce (enforce-versions) @ trinidad-example
---
[INFO] 
[INFO] --- maven-xrts-plugin:2.0.6:generate-sources (default) @ trinidad-example ---
[INFO] 
[INFO] --- maven-remote-resources-plugin:1.0-alpha-6:process (default) @ trinidad-example
---
[INFO] 
[INFO] --- maven-xrts-plugin:2.0.6:generate-test-sources (default) @ trinidad-example ---
[INFO] 
[INFO] --- maven-enforcer-plugin:1.0-beta-1:enforce (enforce-versions) @ trinidad-example
---
[INFO] 
[INFO] --- maven-xrts-plugin:2.0.6:generate-sources (default) @ trinidad-example ---
ignoring exception during new ExecutedMojo null
[INFO] 
[INFO] --- maven-source-plugin:2.1.2:jar (attach-source) @ trinidad-example ---
[INFO] [INFO] Installing <https://builds.apache.org/job/myfaces-trinidad-core-2/ws/trinidad-examples/pom.xml>
to /home/jenkins/.m2/repository/org/apache/myfaces/trinidad/trinidad-example/2.0.2-SNAPSHOT/trinidad-example-2.0.2-SNAPSHOT.pom

[INFO] --- maven-install-plugin:2.3:install (default-install) @ trinidad-example ---
[INFO] Downloading: https://repository.apache.org/content/repositories/snapshots/org/apache/myfaces/trinidad/trinidad-example/2.0.2-SNAPSHOT/maven-metadata.xml

[INFO] --- maven-deploy-plugin:2.5:deploy (default-deploy) @ trinidad-example ---
Downloaded: https://repository.apache.org/content/repositories/snapshots/org/apache/myfaces/trinidad/trinidad-example/2.0.2-SNAPSHOT/maven-metadata.xml
(622 B at 2.0 KB/sec)
Uploading: https://repository.apache.org/content/repositories/snapshots/org/apache/myfaces/trinidad/trinidad-example/2.0.2-SNAPSHOT/trinidad-example-2.0.2-20111004.001437-21.pom
Uploaded: https://repository.apache.org/content/repositories/snapshots/org/apache/myfaces/trinidad/trinidad-example/2.0.2-SNAPSHOT/trinidad-example-2.0.2-20111004.001437-21.pom
(6 KB at 14.8 KB/sec)
Downloading: https://repository.apache.org/content/repositories/snapshots/org/apache/myfaces/trinidad/trinidad-example/maven-metadata.xml
Downloaded: https://repository.apache.org/content/repositories/snapshots/org/apache/myfaces/trinidad/trinidad-example/maven-metadata.xml
(7 KB at 53.1 KB/sec)
Uploading: https://repository.apache.org/content/repositories/snapshots/org/apache/myfaces/trinidad/trinidad-example/2.0.2-SNAPSHOT/maven-metadata.xml
Uploaded: https://repository.apache.org/content/repositories/snapshots/org/apache/myfaces/trinidad/trinidad-example/2.0.2-SNAPSHOT/maven-metadata.xml
(622 B at 3.5 KB/sec)
Uploading: https://repository.apache.org/content/repositories/snapshots/org/apache/myfaces/trinidad/trinidad-example/maven-metadata.xml
Uploaded: https://repository.apache.org/content/repositories/snapshots/org/apache/myfaces/trinidad/trinidad-example/maven-metadata.xml
(7 KB at 42.7 KB/sec)
[INFO] [INFO] Deleting <https://builds.apache.org/job/myfaces-trinidad-core-2/ws/trinidad-examples/trinidad-blank/target>
                                                                        
[INFO] ------------------------------------------------------------------------
[INFO] Building Apache MyFaces Trinidad Blank Demo 2.0.2-SNAPSHOT
[INFO] ------------------------------------------------------------------------
[INFO] 
[INFO] --- maven-clean-plugin:2.4.1:clean (default-clean) @ trinidad-blank ---
[INFO] 
[INFO] --- maven-enforcer-plugin:1.0-beta-1:enforce (enforce-versions) @ trinidad-blank ---
[INFO] 
[INFO] --- maven-xrts-plugin:2.0.6:generate-sources (default) @ trinidad-blank ---
[INFO] 
[INFO] --- maven-remote-resources-plugin:1.0-alpha-6:process (default) @ trinidad-blank ---
[INFO] [INFO] Using 'UTF-8' encoding to copy filtered resources.
[INFO] skip non existing resourceDirectory <https://builds.apache.org/job/myfaces-trinidad-core-2/ws/trinidad-examples/trinidad-blank/src/main/resources>
[INFO] Copying 2 resources

[INFO] --- maven-resources-plugin:2.4.3:resources (default-resources) @ trinidad-blank ---
[INFO] [INFO] Compiling 1 source file to <https://builds.apache.org/job/myfaces-trinidad-core-2/ws/trinidad-examples/trinidad-blank/target/classes>

[INFO] --- maven-compiler-plugin:2.3.1:compile (default-compile) @ trinidad-blank ---
[INFO] ------------------------------------------------------------------------
[INFO] Reactor Summary:
[INFO] 
[INFO] Apache MyFaces Trinidad 2.0 ....................... SUCCESS [15.229s]
[INFO] Apache MyFaces Trinidad Build ..................... SUCCESS [24.330s]
[INFO] Apache MyFaces Trinidad API ....................... SUCCESS [2:10.281s]
[INFO] Apache MyFaces Trinidad Impl ...................... SUCCESS [3:27.055s]
[INFO] Apache MyFaces Trinidad Examples .................. SUCCESS [14.381s]
[INFO] Apache MyFaces Trinidad Blank Demo ................ FAILURE [7.151s]
[INFO] Apache MyFaces Trinidad Demo ...................... SKIPPED
[INFO] Apache MyFaces Trinidad Components Showcase ....... SKIPPED
[INFO] ------------------------------------------------------------------------
[INFO] BUILD FAILURE
[INFO] ------------------------------------------------------------------------
[INFO] Total time: 8:04.976s
[INFO] Finished at: Tue Oct 04 00:14:49 UTC 2011
[INFO] Final Memory: 70M/947M
[INFO] ------------------------------------------------------------------------
mavenExecutionResult exceptions not empty
message : Internal error: java.lang.reflect.UndeclaredThrowableException
cause : null
Stack trace : 
org.apache.maven.InternalErrorException: Internal error: java.lang.reflect.UndeclaredThrowableException
	at org.apache.maven.lifecycle.internal.BuilderCommon.handleBuildError(BuilderCommon.java:128)
	at org.apache.maven.lifecycle.internal.LifecycleModuleBuilder.buildProject(LifecycleModuleBuilder.java:95)
	at org.apache.maven.lifecycle.internal.LifecycleModuleBuilder.buildProject(LifecycleModuleBuilder.java:59)
	at org.apache.maven.lifecycle.internal.LifecycleStarter.singleThreadedBuild(LifecycleStarter.java:183)
	at org.apache.maven.lifecycle.internal.LifecycleStarter.execute(LifecycleStarter.java:161)
	at org.apache.maven.DefaultMaven.doExecute(DefaultMaven.java:319)
	at org.apache.maven.DefaultMaven.execute(DefaultMaven.java:156)
	at org.jvnet.hudson.maven3.launcher.Maven3Launcher.main(Maven3Launcher.java:79)
	at sun.reflect.NativeMethodAccessorImpl.invoke0(Native Method)
	at sun.reflect.NativeMethodAccessorImpl.invoke(NativeMethodAccessorImpl.java:39)
	at sun.reflect.DelegatingMethodAccessorImpl.invoke(DelegatingMethodAccessorImpl.java:25)
	at java.lang.reflect.Method.invoke(Method.java:597)
	at org.codehaus.plexus.classworlds.launcher.Launcher.launchStandard(Launcher.java:329)
	at org.codehaus.plexus.classworlds.launcher.Launcher.launch(Launcher.java:239)
	at org.jvnet.hudson.maven3.agent.Maven3Main.launch(Maven3Main.java:158)
	at hudson.maven.Maven3Builder.call(Maven3Builder.java:122)
	at hudson.maven.Maven3Builder.call(Maven3Builder.java:74)
	at hudson.remoting.UserRequest.perform(UserRequest.java:118)
	at hudson.remoting.UserRequest.perform(UserRequest.java:48)
	at hudson.remoting.Request$2.run(Request.java:287)
	at java.util.concurrent.Executors$RunnableAdapter.call(Executors.java:441)
	at java.util.concurrent.FutureTask$Sync.innerRun(FutureTask.java:303)
	at java.util.concurrent.FutureTask.run(FutureTask.java:138)
	at java.util.concurrent.ThreadPoolExecutor$Worker.runTask(ThreadPoolExecutor.java:886)
	at java.util.concurrent.ThreadPoolExecutor$Worker.run(ThreadPoolExecutor.java:908)
	at java.lang.Thread.run(Thread.java:619)
Caused by: java.lang.reflect.UndeclaredThrowableException
	at $Proxy2.setExecutedMojos(Unknown Source)
	at hudson.maven.MavenBuildProxy$Filter.setExecutedMojos(MavenBuildProxy.java:240)
	at hudson.maven.MavenBuildProxy$Filter.setExecutedMojos(MavenBuildProxy.java:240)
	at hudson.maven.Maven3Builder$MavenExecutionListener.recordMojoFailed(Maven3Builder.java:638)
	at hudson.maven.Maven3Builder$MavenExecutionListener.mojoFailed(Maven3Builder.java:601)
	at org.apache.maven.lifecycle.internal.DefaultExecutionEventCatapult.fire(DefaultExecutionEventCatapult.java:90)
	at org.apache.maven.lifecycle.internal.MojoExecutor.execute(MojoExecutor.java:232)
	at org.apache.maven.lifecycle.internal.MojoExecutor.execute(MojoExecutor.java:153)
	at org.apache.maven.lifecycle.internal.MojoExecutor.execute(MojoExecutor.java:145)
	at org.apache.maven.lifecycle.internal.LifecycleModuleBuilder.buildProject(LifecycleModuleBuilder.java:84)
	... 24 more
Caused by: java.io.IOException: Remote call on channel failed
	at hudson.remoting.Channel.call(Channel.java:690)
	at hudson.remoting.RemoteInvocationHandler.invoke(RemoteInvocationHandler.java:158)
	... 34 more
Caused by: java.lang.OutOfMemoryError: PermGen space
	at java.lang.Class.getDeclaredConstructors0(Native Method)
	at java.lang.Class.privateGetDeclaredConstructors(Class.java:2389)
	at java.lang.Class.getConstructor0(Class.java:2699)
	at java.lang.Class.newInstance0(Class.java:326)
	at java.lang.Class.newInstance(Class.java:308)
	at sun.reflect.MethodAccessorGenerator$1.run(MethodAccessorGenerator.java:381)
	at java.security.AccessController.doPrivileged(Native Method)
	at sun.reflect.MethodAccessorGenerator.generate(MethodAccessorGenerator.java:377)
	at sun.reflect.MethodAccessorGenerator.generateSerializationConstructor(MethodAccessorGenerator.java:95)
	at sun.reflect.ReflectionFactory.newConstructorForSerialization(ReflectionFactory.java:313)
	at java.io.ObjectStreamClass.getSerializableConstructor(ObjectStreamClass.java:1327)
	at java.io.ObjectStreamClass.access$1500(ObjectStreamClass.java:52)
	at java.io.ObjectStreamClass$2.run(ObjectStreamClass.java:437)
	at java.security.AccessController.doPrivileged(Native Method)
	at java.io.ObjectStreamClass.<init>(ObjectStreamClass.java:413)
	at java.io.ObjectStreamClass.lookup(ObjectStreamClass.java:310)
	at java.io.ObjectStreamClass.<init>(ObjectStreamClass.java:409)
	at java.io.ObjectStreamClass.lookup(ObjectStreamClass.java:310)
	at java.io.ObjectOutputStream.writeObject0(ObjectOutputStream.java:1106)
	at java.io.ObjectOutputStream.writeObject(ObjectOutputStream.java:326)
	at hudson.remoting.UserRequest._serialize(UserRequest.java:155)
	at hudson.remoting.UserRequest.serialize(UserRequest.java:164)
	at hudson.remoting.UserRequest.<init>(UserRequest.java:62)
	at hudson.remoting.Channel.call(Channel.java:680)
	at hudson.remoting.RemoteInvocationHandler.invoke(RemoteInvocationHandler.java:158)
	at $Proxy2.setExecutedMojos(Unknown Source)
	at hudson.maven.MavenBuildProxy$Filter.setExecutedMojos(MavenBuildProxy.java:240)
	at hudson.maven.MavenBuildProxy$Filter.setExecutedMojos(MavenBuildProxy.java:240)
	at hudson.maven.Maven3Builder$MavenExecutionListener.recordMojoFailed(Maven3Builder.java:638)
	at hudson.maven.Maven3Builder$MavenExecutionListener.mojoFailed(Maven3Builder.java:601)
	at org.apache.maven.lifecycle.internal.DefaultExecutionEventCatapult.fire(DefaultExecutionEventCatapult.java:90)
	at org.apache.maven.lifecycle.internal.MojoExecutor.execute(MojoExecutor.java:232)
channel stopped


Mime
View raw message