myfaces-commits mailing list archives

Site index · List index
Message view « Date » · « Thread »
Top « Date » · « Thread »
From Apache Jenkins Server <jenk...@builds.apache.org>
Subject Build failed in Jenkins: tobago-trunk » Tobago Core #386
Date Mon, 10 Oct 2011 14:06:44 GMT
See <https://builds.apache.org/job/tobago-trunk/org.apache.myfaces.tobago$tobago-core/386/changes>

Changes:

[bommel] (TOBAGO-1038)
ResetInputActionListener to reset all EditableValueHolder in a page or in a subform or a part
of the component tree

------------------------------------------
[INFO] ------------------------------------------------------------------------
[INFO] Building Tobago Core
[INFO]    task-segment: [clean, animal-sniffer:check, checkstyle:check, install]
[INFO] ------------------------------------------------------------------------
[INFO] [clean:clean {execution: default-clean}]
[INFO] [animal-sniffer:check {execution: default-cli}]
[INFO] Checking unresolved references to org.codehaus.mojo.signature:java15:1.0
[INFO] [checkstyle:check {execution: default-cli}]
[INFO] 
[INFO] [enforcer:enforce {execution: enforce}]
[INFO] [remote-resources:process {execution: default}]
[INFO] [resources:resources {execution: default-resources}]
[INFO] Using 'UTF-8' encoding to copy filtered resources.
[INFO] Copying 6 resources
[INFO] Copying 3 resources
[INFO] [build-helper:add-source {execution: default}]
[INFO] Source directory: <https://builds.apache.org/job/tobago-trunk/org.apache.myfaces.tobago$tobago-core/ws/src/main/java-jsf-1.2>
added.
[INFO] [build-helper:add-source {execution: add-source}]
[INFO] Source directory: <https://builds.apache.org/job/tobago-trunk/org.apache.myfaces.tobago$tobago-core/ws/target/generated-component>
added.
[INFO] [compiler:compile {execution: default-compile}]
[INFO] Compiling 435 source files to <https://builds.apache.org/job/tobago-trunk/org.apache.myfaces.tobago$tobago-core/ws/target/classes>
[INFO] -------------------------------------------------------------
[ERROR] COMPILATION ERROR : 
[INFO] -------------------------------------------------------------
[ERROR] <https://builds.apache.org/job/tobago-trunk/org.apache.myfaces.tobago$tobago-core/ws/src/main/java/org/apache/myfaces/tobago/internal/taglib/component/ResetInputActionListenerTag.java>:[48,51]
cannot find symbol
symbol  : variable EXECUTE
location: class org.apache.myfaces.tobago.component.Attributes
[INFO] 1 error
[INFO] -------------------------------------------------------------
[JENKINS] Archiving <https://builds.apache.org/job/tobago-trunk/org.apache.myfaces.tobago$tobago-core/ws/pom.xml>
to /home/hudson/hudson/jobs/tobago-trunk/modules/org.apache.myfaces.tobago$tobago-core/builds/2011-10-10_14-05-39/archive/org.apache.myfaces.tobago/tobago-core/1.5.0-beta-2-SNAPSHOT/tobago-core-1.5.0-beta-2-SNAPSHOT.pom
[INFO] ------------------------------------------------------------------------
[ERROR] BUILD FAILURE
[INFO] ------------------------------------------------------------------------
[INFO] Compilation failure
<https://builds.apache.org/job/tobago-trunk/org.apache.myfaces.tobago$tobago-core/ws/src/main/java/org/apache/myfaces/tobago/internal/taglib/component/ResetInputActionListenerTag.java>:[48,51]
cannot find symbol
symbol  : variable EXECUTE
location: class org.apache.myfaces.tobago.component.Attributes

[INFO] ------------------------------------------------------------------------
[INFO] For more information, run Maven with the -e switch
[INFO] ------------------------------------------------------------------------
[INFO] Total time: 37 seconds
[INFO] Finished at: Mon Oct 10 14:06:44 UTC 2011
[INFO] Final Memory: 72M/423M
[INFO] ------------------------------------------------------------------------


Mime
View raw message