myfaces-commits mailing list archives

Site index · List index
Message view « Date » · « Thread »
Top « Date » · « Thread »
From Apache Jenkins Server <jenk...@builds.apache.org>
Subject Build failed in Jenkins: tobago-trunk #386
Date Mon, 10 Oct 2011 14:06:46 GMT
See <https://builds.apache.org/job/tobago-trunk/386/changes>

Changes:

[lofwyr] fix link label (version)

[bommel] (TOBAGO-1038)
ResetInputActionListener to reset all EditableValueHolder in a page or in a subform or a part
of the component tree

------------------------------------------
[...truncated 3319 lines...]
[INFO]   Tobago Core
[INFO]   Tobago Extensions
[INFO]   Tobago Taglib Extension
[INFO]   Tobago Themes
[INFO]   Tobago Theme Standard
[INFO]   Tobago Theme Scarborough
[INFO]   Tobago Theme Speyside
[INFO]   Tobago Theme Richmond
[INFO]   Tobago Theme Charlotteville
[INFO]   Tobago Deprecation
[INFO]   Tobago Facelets
[INFO]   Tobago Fileupload
[INFO]   Tobago Sandbox
[INFO]   Tobago Security
[INFO]   Tobago Examples
[INFO]   Tobago Example Addressbook
[INFO]   Tobago Example Blank
[INFO]   Tobago Example Data (to use in other examples)
[INFO]   Tobago Example Demo
[INFO]   Tobago Example Non-Faces-Request
[INFO]   Tobago Example Experimental
[INFO]   Tobago Example Test
[INFO]   Tobago Example for Portlets
[INFO]   Tobago Example Sandbox
[INFO]   Tobago Example Security
[INFO]   Tobago Example Assembly
[INFO]   Tobago Theme Example
[INFO]   Tobago Example Seam
[INFO]   Tobago Assembly
[INFO] ------------------------------------------------------------------------
[INFO] Building Apache Tobago
[INFO]    task-segment: [clean, animal-sniffer:check, checkstyle:check, install]
[INFO] ------------------------------------------------------------------------
[INFO] [clean:clean {execution: default-clean}]
[INFO] [animal-sniffer:check {execution: default-cli}]
[INFO] Checking unresolved references to org.codehaus.mojo.signature:java15:1.0
[INFO] [checkstyle:check {execution: default-cli}]
[INFO] 
[INFO] [enforcer:enforce {execution: enforce}]
[INFO] Setting property: classpath.resource.loader.class => 'org.codehaus.plexus.velocity.ContextClassLoaderResourceLoader'.
[INFO] Setting property: velocimacro.messages.on => 'false'.
[INFO] Setting property: resource.loader => 'classpath'.
[INFO] Setting property: resource.manager.logwhenfound => 'false'.
[INFO] [remote-resources:process {execution: default}]
[INFO] [build-helper:add-source {execution: default}]
[INFO] Source directory: <https://builds.apache.org/job/tobago-trunk/ws/tobago-trunk/src/main/java-jsf-1.2>
added.
[INFO] [site:attach-descriptor {execution: default-attach-descriptor}]
[INFO] Parent project loaded from repository: org.apache.myfaces:myfaces:pom:10
[INFO] [install:install {execution: default-install}]
[INFO] Installing <https://builds.apache.org/job/tobago-trunk/ws/tobago-trunk/pom.xml>
to /home/jenkins/.m2/repository/org/apache/myfaces/tobago/tobago/1.5.0-beta-2-SNAPSHOT/tobago-1.5.0-beta-2-SNAPSHOT.pom
[INFO] Installing <https://builds.apache.org/job/tobago-trunk/ws/tobago-trunk/target/tobago-1.5.0-beta-2-SNAPSHOT-site.xml>
to /home/jenkins/.m2/repository/org/apache/myfaces/tobago/tobago/1.5.0-beta-2-SNAPSHOT/tobago-1.5.0-beta-2-SNAPSHOT-site.xml
[JENKINS] Archiving <https://builds.apache.org/job/tobago-trunk/ws/tobago-trunk/pom.xml>
to /home/hudson/hudson/jobs/tobago-trunk/modules/org.apache.myfaces.tobago$tobago/builds/2011-10-10_14-05-39/archive/org.apache.myfaces.tobago/tobago/1.5.0-beta-2-SNAPSHOT/tobago-1.5.0-beta-2-SNAPSHOT.pom
[JENKINS] Archiving <https://builds.apache.org/job/tobago-trunk/ws/tobago-trunk/target/tobago-1.5.0-beta-2-SNAPSHOT-site.xml>
to /home/hudson/hudson/jobs/tobago-trunk/modules/org.apache.myfaces.tobago$tobago/builds/2011-10-10_14-05-39/archive/org.apache.myfaces.tobago/tobago/1.5.0-beta-2-SNAPSHOT/tobago-1.5.0-beta-2-SNAPSHOT-site.xml
[INFO] ------------------------------------------------------------------------
[INFO] Building Tobago Tool
[INFO]    task-segment: [clean, animal-sniffer:check, checkstyle:check, install]
[INFO] ------------------------------------------------------------------------
[INFO] [clean:clean {execution: default-clean}]
[INFO] [animal-sniffer:check {execution: default-cli}]
[INFO] Checking unresolved references to org.codehaus.mojo.signature:java15:1.0
[INFO] [checkstyle:check {execution: default-cli}]
[INFO] 
[INFO] [enforcer:enforce {execution: enforce}]
[INFO] [remote-resources:process {execution: default}]
[INFO] [build-helper:add-source {execution: default}]
[INFO] Source directory: <https://builds.apache.org/job/tobago-trunk/ws/tobago-trunk/tobago-tool/src/main/java-jsf-1.2>
added.
[INFO] [site:attach-descriptor {execution: default-attach-descriptor}]
[INFO] [install:install {execution: default-install}]
[INFO] Installing <https://builds.apache.org/job/tobago-trunk/ws/tobago-trunk/tobago-tool/pom.xml>
to /home/jenkins/.m2/repository/org/apache/myfaces/tobago/tobago-tool/1.5.0-beta-2-SNAPSHOT/tobago-tool-1.5.0-beta-2-SNAPSHOT.pom
[JENKINS] Archiving <https://builds.apache.org/job/tobago-trunk/ws/tobago-trunk/tobago-tool/pom.xml>
to /home/hudson/hudson/jobs/tobago-trunk/modules/org.apache.myfaces.tobago$tobago-tool/builds/2011-10-10_14-05-39/archive/org.apache.myfaces.tobago/tobago-tool/1.5.0-beta-2-SNAPSHOT/tobago-tool-1.5.0-beta-2-SNAPSHOT.pom
[INFO] ------------------------------------------------------------------------
[INFO] Building Tobago Tool Annotation
[INFO]    task-segment: [clean, animal-sniffer:check, checkstyle:check, install]
[INFO] ------------------------------------------------------------------------
[INFO] [clean:clean {execution: default-clean}]
[INFO] [animal-sniffer:check {execution: default-cli}]
[INFO] Checking unresolved references to org.codehaus.mojo.signature:java15:1.0
[INFO] [checkstyle:check {execution: default-cli}]
[INFO] 
[INFO] [enforcer:enforce {execution: enforce}]
[INFO] [remote-resources:process {execution: default}]
[INFO] [resources:resources {execution: default-resources}]
[INFO] Using 'UTF-8' encoding to copy filtered resources.
[INFO] skip non existing resourceDirectory <https://builds.apache.org/job/tobago-trunk/ws/tobago-trunk/tobago-tool/tobago-tool-annotation/src/main/resources>
[INFO] Copying 3 resources
[INFO] [build-helper:add-source {execution: default}]
[INFO] Source directory: <https://builds.apache.org/job/tobago-trunk/ws/tobago-trunk/tobago-tool/tobago-tool-annotation/src/main/java-jsf-1.2>
added.
[INFO] [compiler:compile {execution: default-compile}]
[INFO] Compiling 15 source files to <https://builds.apache.org/job/tobago-trunk/ws/tobago-trunk/tobago-tool/tobago-tool-annotation/target/classes>
[INFO] [resources:testResources {execution: default-testResources}]
[INFO] Using 'UTF-8' encoding to copy filtered resources.
[INFO] skip non existing resourceDirectory <https://builds.apache.org/job/tobago-trunk/ws/tobago-trunk/tobago-tool/tobago-tool-annotation/src/test/resources>
[INFO] Copying 3 resources
[INFO] [compiler:testCompile {execution: default-testCompile}]
[INFO] No sources to compile
[INFO] [surefire:test {execution: default-test}]
[INFO] Surefire report directory: <https://builds.apache.org/job/tobago-trunk/ws/tobago-trunk/tobago-tool/tobago-tool-annotation/target/surefire-reports>

-------------------------------------------------------
 T E S T S
-------------------------------------------------------
There are no tests to run.

Results :

Tests run: 0, Failures: 0, Errors: 0, Skipped: 0

[JENKINS] Recording test results
[INFO] [jar:jar {execution: default-jar}]
[INFO] Building jar: <https://builds.apache.org/job/tobago-trunk/ws/tobago-trunk/tobago-tool/tobago-tool-annotation/target/tobago-tool-annotation-1.5.0-beta-2-SNAPSHOT.jar>
[INFO] [install:install {execution: default-install}]
[INFO] Installing <https://builds.apache.org/job/tobago-trunk/ws/tobago-trunk/tobago-tool/tobago-tool-annotation/target/tobago-tool-annotation-1.5.0-beta-2-SNAPSHOT.jar>
to /home/jenkins/.m2/repository/org/apache/myfaces/tobago/tobago-tool-annotation/1.5.0-beta-2-SNAPSHOT/tobago-tool-annotation-1.5.0-beta-2-SNAPSHOT.jar
[JENKINS] Archiving <https://builds.apache.org/job/tobago-trunk/ws/tobago-trunk/tobago-tool/tobago-tool-annotation/pom.xml>
to /home/hudson/hudson/jobs/tobago-trunk/modules/org.apache.myfaces.tobago$tobago-tool-annotation/builds/2011-10-10_14-05-39/archive/org.apache.myfaces.tobago/tobago-tool-annotation/1.5.0-beta-2-SNAPSHOT/tobago-tool-annotation-1.5.0-beta-2-SNAPSHOT.pom
[JENKINS] Archiving <https://builds.apache.org/job/tobago-trunk/ws/tobago-trunk/tobago-tool/tobago-tool-annotation/target/tobago-tool-annotation-1.5.0-beta-2-SNAPSHOT.jar>
to /home/hudson/hudson/jobs/tobago-trunk/modules/org.apache.myfaces.tobago$tobago-tool-annotation/builds/2011-10-10_14-05-39/archive/org.apache.myfaces.tobago/tobago-tool-annotation/1.5.0-beta-2-SNAPSHOT/tobago-tool-annotation-1.5.0-beta-2-SNAPSHOT.jar
[INFO] ------------------------------------------------------------------------
[INFO] Building Tobago Tool Apt
[INFO]    task-segment: [clean, animal-sniffer:check, checkstyle:check, install]
[INFO] ------------------------------------------------------------------------
[INFO] [clean:clean {execution: default-clean}]
[INFO] [animal-sniffer:check {execution: default-cli}]
[INFO] Checking unresolved references to org.codehaus.mojo.signature:java15:1.0
[INFO] [checkstyle:check {execution: default-cli}]
[INFO] 
[INFO] [enforcer:enforce {execution: enforce}]
[INFO] [remote-resources:process {execution: default}]
[INFO] [resources:resources {execution: default-resources}]
[INFO] Using 'UTF-8' encoding to copy filtered resources.
[INFO] Copying 9 resources
[INFO] Copying 3 resources
[INFO] [build-helper:add-source {execution: default}]
[INFO] Source directory: <https://builds.apache.org/job/tobago-trunk/ws/tobago-trunk/tobago-tool/tobago-tool-apt/src/main/java-jsf-1.2>
added.
[INFO] [compiler:compile {execution: default-compile}]
[INFO] Compiling 28 source files to <https://builds.apache.org/job/tobago-trunk/ws/tobago-trunk/tobago-tool/tobago-tool-apt/target/classes>
[INFO] [resources:testResources {execution: default-testResources}]
[INFO] Using 'UTF-8' encoding to copy filtered resources.
[INFO] skip non existing resourceDirectory <https://builds.apache.org/job/tobago-trunk/ws/tobago-trunk/tobago-tool/tobago-tool-apt/src/test/resources>
[INFO] Copying 3 resources
[INFO] [compiler:testCompile {execution: default-testCompile}]
[INFO] No sources to compile
[INFO] [surefire:test {execution: default-test}]
[INFO] Surefire report directory: <https://builds.apache.org/job/tobago-trunk/ws/tobago-trunk/tobago-tool/tobago-tool-apt/target/surefire-reports>

-------------------------------------------------------
 T E S T S
-------------------------------------------------------
There are no tests to run.

Results :

Tests run: 0, Failures: 0, Errors: 0, Skipped: 0

[JENKINS] Recording test results
[INFO] [jar:jar {execution: default-jar}]
[INFO] Building jar: <https://builds.apache.org/job/tobago-trunk/ws/tobago-trunk/tobago-tool/tobago-tool-apt/target/tobago-tool-apt-1.5.0-beta-2-SNAPSHOT.jar>
[INFO] [install:install {execution: default-install}]
[INFO] Installing <https://builds.apache.org/job/tobago-trunk/ws/tobago-trunk/tobago-tool/tobago-tool-apt/target/tobago-tool-apt-1.5.0-beta-2-SNAPSHOT.jar>
to /home/jenkins/.m2/repository/org/apache/myfaces/tobago/tobago-tool-apt/1.5.0-beta-2-SNAPSHOT/tobago-tool-apt-1.5.0-beta-2-SNAPSHOT.jar
[JENKINS] Archiving <https://builds.apache.org/job/tobago-trunk/ws/tobago-trunk/tobago-tool/tobago-tool-apt/pom.xml>
to /home/hudson/hudson/jobs/tobago-trunk/modules/org.apache.myfaces.tobago$tobago-tool-apt/builds/2011-10-10_14-05-39/archive/org.apache.myfaces.tobago/tobago-tool-apt/1.5.0-beta-2-SNAPSHOT/tobago-tool-apt-1.5.0-beta-2-SNAPSHOT.pom
[JENKINS] Archiving <https://builds.apache.org/job/tobago-trunk/ws/tobago-trunk/tobago-tool/tobago-tool-apt/target/tobago-tool-apt-1.5.0-beta-2-SNAPSHOT.jar>
to /home/hudson/hudson/jobs/tobago-trunk/modules/org.apache.myfaces.tobago$tobago-tool-apt/builds/2011-10-10_14-05-39/archive/org.apache.myfaces.tobago/tobago-tool-apt/1.5.0-beta-2-SNAPSHOT/tobago-tool-apt-1.5.0-beta-2-SNAPSHOT.jar
[INFO] ------------------------------------------------------------------------
[INFO] Building Tobago JSF Compatibility
[INFO]    task-segment: [clean, animal-sniffer:check, checkstyle:check, install]
[INFO] ------------------------------------------------------------------------
[INFO] [clean:clean {execution: default-clean}]
[INFO] [animal-sniffer:check {execution: default-cli}]
[INFO] Checking unresolved references to org.codehaus.mojo.signature:java15:1.0
[INFO] [checkstyle:check {execution: default-cli}]
[INFO] 
[INFO] [enforcer:enforce {execution: enforce}]
[INFO] [remote-resources:process {execution: default}]
[INFO] [resources:resources {execution: default-resources}]
[INFO] Using 'UTF-8' encoding to copy filtered resources.
[INFO] skip non existing resourceDirectory <https://builds.apache.org/job/tobago-trunk/ws/tobago-trunk/tobago-jsf-compat/src/main/resources>
[INFO] Copying 3 resources
[INFO] [build-helper:add-source {execution: default}]
[INFO] Source directory: <https://builds.apache.org/job/tobago-trunk/ws/tobago-trunk/tobago-jsf-compat/src/main/java-jsf-1.2>
added.
[INFO] [compiler:compile {execution: default-compile}]
[INFO] Compiling 48 source files to <https://builds.apache.org/job/tobago-trunk/ws/tobago-trunk/tobago-jsf-compat/target/classes>
[INFO] [resources:testResources {execution: default-testResources}]
[INFO] Using 'UTF-8' encoding to copy filtered resources.
[INFO] skip non existing resourceDirectory <https://builds.apache.org/job/tobago-trunk/ws/tobago-trunk/tobago-jsf-compat/src/test/resources>
[INFO] Copying 3 resources
[INFO] [compiler:testCompile {execution: default-testCompile}]
[INFO] Nothing to compile - all classes are up to date
[INFO] [surefire:test {execution: default-test}]
[INFO] Surefire report directory: <https://builds.apache.org/job/tobago-trunk/ws/tobago-trunk/tobago-jsf-compat/target/surefire-reports>

-------------------------------------------------------
 T E S T S
-------------------------------------------------------
There are no tests to run.

Results :

Tests run: 0, Failures: 0, Errors: 0, Skipped: 0

[JENKINS] Recording test results
[INFO] [jar:jar {execution: default-jar}]
[INFO] Building jar: <https://builds.apache.org/job/tobago-trunk/ws/tobago-trunk/tobago-jsf-compat/target/tobago-jsf-compat-1.5.0-beta-2-SNAPSHOT.jar>
[INFO] [install:install {execution: default-install}]
[INFO] Installing <https://builds.apache.org/job/tobago-trunk/ws/tobago-trunk/tobago-jsf-compat/target/tobago-jsf-compat-1.5.0-beta-2-SNAPSHOT.jar>
to /home/jenkins/.m2/repository/org/apache/myfaces/tobago/tobago-jsf-compat/1.5.0-beta-2-SNAPSHOT/tobago-jsf-compat-1.5.0-beta-2-SNAPSHOT.jar
[JENKINS] Archiving <https://builds.apache.org/job/tobago-trunk/ws/tobago-trunk/tobago-jsf-compat/pom.xml>
to /home/hudson/hudson/jobs/tobago-trunk/modules/org.apache.myfaces.tobago$tobago-jsf-compat/builds/2011-10-10_14-05-39/archive/org.apache.myfaces.tobago/tobago-jsf-compat/1.5.0-beta-2-SNAPSHOT/tobago-jsf-compat-1.5.0-beta-2-SNAPSHOT.pom
[JENKINS] Archiving <https://builds.apache.org/job/tobago-trunk/ws/tobago-trunk/tobago-jsf-compat/target/tobago-jsf-compat-1.5.0-beta-2-SNAPSHOT.jar>
to /home/hudson/hudson/jobs/tobago-trunk/modules/org.apache.myfaces.tobago$tobago-jsf-compat/builds/2011-10-10_14-05-39/archive/org.apache.myfaces.tobago/tobago-jsf-compat/1.5.0-beta-2-SNAPSHOT/tobago-jsf-compat-1.5.0-beta-2-SNAPSHOT.jar
[INFO] ------------------------------------------------------------------------
[INFO] Building Tobago Core
[INFO]    task-segment: [clean, animal-sniffer:check, checkstyle:check, install]
[INFO] ------------------------------------------------------------------------
[INFO] [clean:clean {execution: default-clean}]
[INFO] [animal-sniffer:check {execution: default-cli}]
[INFO] Checking unresolved references to org.codehaus.mojo.signature:java15:1.0
[INFO] [checkstyle:check {execution: default-cli}]
[INFO] 
[INFO] [enforcer:enforce {execution: enforce}]
[INFO] [remote-resources:process {execution: default}]
[INFO] [resources:resources {execution: default-resources}]
[INFO] Using 'UTF-8' encoding to copy filtered resources.
[INFO] Copying 6 resources
[INFO] Copying 3 resources
[INFO] [build-helper:add-source {execution: default}]
[INFO] Source directory: <https://builds.apache.org/job/tobago-trunk/ws/tobago-trunk/tobago-core/src/main/java-jsf-1.2>
added.
[INFO] [build-helper:add-source {execution: add-source}]
[INFO] Source directory: <https://builds.apache.org/job/tobago-trunk/ws/tobago-trunk/tobago-core/target/generated-component>
added.
[INFO] [compiler:compile {execution: default-compile}]
[INFO] Compiling 435 source files to <https://builds.apache.org/job/tobago-trunk/ws/tobago-trunk/tobago-core/target/classes>
[INFO] -------------------------------------------------------------
[ERROR] COMPILATION ERROR : 
[INFO] -------------------------------------------------------------
[ERROR] <https://builds.apache.org/job/tobago-trunk/ws/tobago-trunk/tobago-core/src/main/java/org/apache/myfaces/tobago/internal/taglib/component/ResetInputActionListenerTag.java>:[48,51]
cannot find symbol
symbol  : variable EXECUTE
location: class org.apache.myfaces.tobago.component.Attributes
[INFO] 1 error
[INFO] -------------------------------------------------------------
[JENKINS] Archiving <https://builds.apache.org/job/tobago-trunk/ws/tobago-trunk/tobago-core/pom.xml>
to /home/hudson/hudson/jobs/tobago-trunk/modules/org.apache.myfaces.tobago$tobago-core/builds/2011-10-10_14-05-39/archive/org.apache.myfaces.tobago/tobago-core/1.5.0-beta-2-SNAPSHOT/tobago-core-1.5.0-beta-2-SNAPSHOT.pom
[INFO] ------------------------------------------------------------------------
[ERROR] BUILD FAILURE
[INFO] ------------------------------------------------------------------------
[INFO] Compilation failure
<https://builds.apache.org/job/tobago-trunk/ws/tobago-trunk/tobago-core/src/main/java/org/apache/myfaces/tobago/internal/taglib/component/ResetInputActionListenerTag.java>:[48,51]
cannot find symbol
symbol  : variable EXECUTE
location: class org.apache.myfaces.tobago.component.Attributes

[INFO] ------------------------------------------------------------------------
[INFO] For more information, run Maven with the -e switch
[INFO] ------------------------------------------------------------------------
[INFO] Total time: 37 seconds
[INFO] Finished at: Mon Oct 10 14:06:44 UTC 2011
[INFO] Final Memory: 72M/423M
[INFO] ------------------------------------------------------------------------
Sending e-mails to: commits@myfaces.apache.org
channel stopped


Mime
View raw message