myfaces-commits mailing list archives

Site index · List index
Message view « Date » · « Thread »
Top « Date » · « Thread »
From Apache Jenkins Server <jenk...@builds.apache.org>
Subject Build failed in Jenkins: myfaces-maven2-plugins » Apache MyFaces Buildtools Maven2 Javascript Documentation Plugin #161
Date Sun, 02 Oct 2011 11:51:47 GMT
See <https://builds.apache.org/job/myfaces-maven2-plugins/org.apache.myfaces.buildtools$myfaces-jsdoc-plugin/161/>

------------------------------------------
[INFO] ------------------------------------------------------------------------
[INFO] Building Apache MyFaces Buildtools Maven2 Javascript Documentation Plugin
[INFO]    task-segment: [install]
[INFO] ------------------------------------------------------------------------
[INFO] [antrun:run {execution: javadoc.resources}]
[INFO] Executing tasks
     [copy] Copying 2 files to <https://builds.apache.org/job/myfaces-maven2-plugins/org.apache.myfaces.buildtools$myfaces-jsdoc-plugin/ws/target/apidocs/META-INF>
[INFO] Executed tasks
[INFO] [plugin:descriptor {execution: default-descriptor}]
[INFO] Using 'UTF-8' encoding to read mojo metadata.
[INFO] Applying mojo extractor for language: java
[INFO] Mojo extractor for language: java found 3 mojo descriptors.
[INFO] Applying mojo extractor for language: bsh
[INFO] Mojo extractor for language: bsh found 0 mojo descriptors.
[INFO] [remote-resources:process {execution: default}]
[INFO] [resources:resources {execution: default-resources}]
[INFO] Using 'UTF-8' encoding to copy filtered resources.
[INFO] Copying 0 resource
[INFO] Copying 3 resources
[INFO] [compiler:compile {execution: default-compile}]
[INFO] Compiling 13 source files to <https://builds.apache.org/job/myfaces-maven2-plugins/org.apache.myfaces.buildtools$myfaces-jsdoc-plugin/ws/target/classes>
[INFO] [resources:testResources {execution: default-testResources}]
[INFO] Using 'UTF-8' encoding to copy filtered resources.
[INFO] skip non existing resourceDirectory <https://builds.apache.org/job/myfaces-maven2-plugins/org.apache.myfaces.buildtools$myfaces-jsdoc-plugin/ws/src/test/resources>
[INFO] Copying 3 resources
[INFO] [compiler:testCompile {execution: default-testCompile}]
[INFO] No sources to compile
[INFO] [surefire:test {execution: default-test}]
[INFO] Surefire report directory: <https://builds.apache.org/job/myfaces-maven2-plugins/org.apache.myfaces.buildtools$myfaces-jsdoc-plugin/ws/target/surefire-reports>

-------------------------------------------------------
 T E S T S
-------------------------------------------------------
There are no tests to run.

Results :

Tests run: 0, Failures: 0, Errors: 0, Skipped: 0

[JENKINS] Recording test results
[INFO] [jar:jar {execution: default-jar}]
[INFO] Building jar: <https://builds.apache.org/job/myfaces-maven2-plugins/org.apache.myfaces.buildtools$myfaces-jsdoc-plugin/ws/target/myfaces-jsdoc-plugin-1.0-beta-2-SNAPSHOT.jar>
[INFO] [plugin:addPluginArtifactMetadata {execution: default-addPluginArtifactMetadata}]
[INFO] Preparing checkstyle:check
[INFO] Setting property: classpath.resource.loader.class => 'org.codehaus.plexus.velocity.ContextClassLoaderResourceLoader'.
[INFO] Setting property: velocimacro.messages.on => 'false'.
[INFO] Setting property: resource.loader => 'classpath'.
[INFO] Setting property: resource.manager.logwhenfound => 'false'.
[INFO] ************************************************************** 
[INFO] Starting Jakarta Velocity v1.4
[INFO] RuntimeInstance initializing.
[INFO] Default Properties File: org/apache/velocity/runtime/defaults/velocity.properties
[INFO] Default ResourceManager initializing. (class org.apache.velocity.runtime.resource.ResourceManagerImpl)
[INFO] Resource Loader Instantiated: org.codehaus.plexus.velocity.ContextClassLoaderResourceLoader
[INFO] ClasspathResourceLoader : initialization starting.
[INFO] ClasspathResourceLoader : initialization complete.
[INFO] ResourceCache : initialized. (class org.apache.velocity.runtime.resource.ResourceCacheImpl)
[INFO] Default ResourceManager initialization complete.
[INFO] Loaded System Directive: org.apache.velocity.runtime.directive.Literal
[INFO] Loaded System Directive: org.apache.velocity.runtime.directive.Macro
[INFO] Loaded System Directive: org.apache.velocity.runtime.directive.Parse
[INFO] Loaded System Directive: org.apache.velocity.runtime.directive.Include
[INFO] Loaded System Directive: org.apache.velocity.runtime.directive.Foreach
[INFO] Created: 20 parsers.
[INFO] Velocimacro : initialization starting.
[INFO] Velocimacro : adding VMs from VM library template : VM_global_library.vm
[ERROR] ResourceManager : unable to find resource 'VM_global_library.vm' in any resource loader.
[INFO] Velocimacro : error using  VM library template VM_global_library.vm : org.apache.velocity.exception.ResourceNotFoundException:
Unable to find resource 'VM_global_library.vm'
[INFO] Velocimacro :  VM library template macro registration complete.
[INFO] Velocimacro : allowInline = true : VMs can be defined inline in templates
[INFO] Velocimacro : allowInlineToOverride = false : VMs defined inline may NOT replace previous
VM definitions
[INFO] Velocimacro : allowInlineLocal = false : VMs defined inline will be  global in scope
if allowed.
[INFO] Velocimacro : initialization complete.
[INFO] Velocity successfully started.
[JENKINS] Archiving <https://builds.apache.org/job/myfaces-maven2-plugins/org.apache.myfaces.buildtools$myfaces-jsdoc-plugin/ws/pom.xml>
to /home/hudson/hudson/jobs/myfaces-maven2-plugins/modules/org.apache.myfaces.buildtools$myfaces-jsdoc-plugin/builds/2011-10-02_11-51-04/archive/org.apache.myfaces.buildtools/myfaces-jsdoc-plugin/1.0-beta-2-SNAPSHOT/myfaces-jsdoc-plugin-1.0-beta-2-SNAPSHOT.pom
[JENKINS] Archiving <https://builds.apache.org/job/myfaces-maven2-plugins/org.apache.myfaces.buildtools$myfaces-jsdoc-plugin/ws/target/myfaces-jsdoc-plugin-1.0-beta-2-SNAPSHOT.jar>
to /home/hudson/hudson/jobs/myfaces-maven2-plugins/modules/org.apache.myfaces.buildtools$myfaces-jsdoc-plugin/builds/2011-10-02_11-51-04/archive/org.apache.myfaces.buildtools/myfaces-jsdoc-plugin/1.0-beta-2-SNAPSHOT/myfaces-jsdoc-plugin-1.0-beta-2-SNAPSHOT.jar
[INFO] [checkstyle:checkstyle {execution: checkstyle}]
[INFO] ------------------------------------------------------------------------
[ERROR] BUILD ERROR
[INFO] ------------------------------------------------------------------------
[INFO] An error has occurred in Checkstyle report generation.

Embedded error: Failed during checkstyle configuration
Property 'fileExtensions' in module Header does not exist, please check the documentation
[INFO] ------------------------------------------------------------------------
[INFO] For more information, run Maven with the -e switch
[INFO] ------------------------------------------------------------------------
[INFO] Total time: 35 seconds
[INFO] Finished at: Sun Oct 02 11:51:47 UTC 2011
[INFO] Final Memory: 95M/441M
[INFO] ------------------------------------------------------------------------


Mime
View raw message