myfaces-commits mailing list archives

Site index · List index
Message view « Date » · « Thread »
Top « Date » · « Thread »
From Apache Jenkins Server <jenk...@builds.apache.org>
Subject Build failed in Jenkins: ExtVal for JSF 1.2 (deploy) #36
Date Sun, 09 Oct 2011 00:05:05 GMT
See <https://builds.apache.org/job/ExtVal%20for%20JSF%201.2%20(deploy)/36/>

------------------------------------------
Started by timer
Building remotely on ubuntu2
Updating https://svn.apache.org/repos/asf/myfaces/extensions/validator/trunk
At revision 1180505
no change for https://svn.apache.org/repos/asf/myfaces/extensions/validator/trunk since the
previous build
Parsing POMs
[trunk] $ /home/hudson/tools/java/latest1.5/bin/java -cp /home/hudson/hudson-slave/maven-agent.jar:/home/hudson/hudson-slave/classworlds.jar
hudson.maven.agent.Main /home/hudson/hudson-slave/tools/Maven_2.2.1 /home/hudson/hudson-slave/slave.jar
/home/hudson/hudson-slave/maven-interceptor.jar 38805 /home/hudson/hudson-slave/maven2.1-interceptor.jar
<==channel started
=[JENKINS REMOTING CAPACITY]===>   Executing Maven:  -B -f <https://builds.apache.org/job/ExtVal%20for%20JSF%201.2%20(deploy)/ws/trunk/pom.xml>
clean install
[INFO] Scanning for projects...
[INFO] Reactor build order: 
[INFO]   Apache MyFaces Extensions-Validator Module
[INFO]   MyFaces Extensions-Validator Core
[INFO]   MyFaces Extensions-Validator Validation-Modules
[INFO]   MyFaces Extensions-Validator Property-Validation-Module
[INFO]   MyFaces Extensions-Validator Bean-Validation-Integration-Module (JSR 303)
[INFO]   MyFaces Extensions-Validator Component-Support Modules
[INFO]   MyFaces Extensions-Validator Trinidad Support Module
[INFO]   MyFaces Extensions-Validator Generic Support Module
[INFO]   MyFaces Extensions-Validator Test-Modules
[INFO]   MyFaces Extensions-Validator Base-Test-Infrastructure
[INFO]   MyFaces Extensions-Validator Core-Tests
[INFO]   MyFaces Extensions-Validator Property-Validation-Tests
[INFO]   MyFaces Extensions-Validator Bean-Validation-Integration-Tests
[INFO]   MyFaces Extensions-Validator Trinidad Component-Support-Tests
[INFO]   MyFaces Extensions-Validator examples project
[INFO]   MyFaces Extensions-Validator examples hello world
[INFO]   MyFaces Extensions-Validator examples hello bean-validation
[INFO]   MyFaces Extensions-Validator examples feature-set 01
[INFO]   MyFaces Extensions-Validator examples feature-set 02
[INFO] ------------------------------------------------------------------------
[INFO] Building Apache MyFaces Extensions-Validator Module
[INFO]    task-segment: [clean, install]
[INFO] ------------------------------------------------------------------------
[INFO] [clean:clean {execution: default-clean}]
[INFO] Deleting file set: <https://builds.apache.org/job/ExtVal%20for%20JSF%201.2%20(deploy)/ws/trunk/target>
(included: [**], excluded: [])
[INFO] [antrun:run {execution: javadoc.resources}]
[INFO] Executing tasks
[INFO] Executed tasks
[INFO] Setting property: classpath.resource.loader.class => 'org.codehaus.plexus.velocity.ContextClassLoaderResourceLoader'.
[INFO] Setting property: velocimacro.messages.on => 'false'.
[INFO] Setting property: resource.loader => 'classpath'.
[INFO] Setting property: resource.manager.logwhenfound => 'false'.
[INFO] [remote-resources:process {execution: default}]
[INFO] [site:attach-descriptor {execution: default-attach-descriptor}]
[INFO] Parent project loaded from repository: org.apache.myfaces:myfaces:pom:9
[INFO] Preparing checkstyle:check
[INFO] Setting property: classpath.resource.loader.class => 'org.codehaus.plexus.velocity.ContextClassLoaderResourceLoader'.
[INFO] Setting property: velocimacro.messages.on => 'false'.
[INFO] Setting property: resource.loader => 'classpath'.
[INFO] Setting property: resource.manager.logwhenfound => 'false'.
[INFO] ************************************************************** 
[INFO] Starting Jakarta Velocity v1.4
[INFO] RuntimeInstance initializing.
[INFO] Default Properties File: org/apache/velocity/runtime/defaults/velocity.properties
[INFO] Default ResourceManager initializing. (class org.apache.velocity.runtime.resource.ResourceManagerImpl)
[INFO] Resource Loader Instantiated: org.codehaus.plexus.velocity.ContextClassLoaderResourceLoader
[INFO] ClasspathResourceLoader : initialization starting.
[INFO] ClasspathResourceLoader : initialization complete.
[INFO] ResourceCache : initialized. (class org.apache.velocity.runtime.resource.ResourceCacheImpl)
[INFO] Default ResourceManager initialization complete.
[INFO] Loaded System Directive: org.apache.velocity.runtime.directive.Literal
[INFO] Loaded System Directive: org.apache.velocity.runtime.directive.Macro
[INFO] Loaded System Directive: org.apache.velocity.runtime.directive.Parse
[INFO] Loaded System Directive: org.apache.velocity.runtime.directive.Include
[INFO] Loaded System Directive: org.apache.velocity.runtime.directive.Foreach
[INFO] Created: 20 parsers.
[INFO] Velocimacro : initialization starting.
[INFO] Velocimacro : adding VMs from VM library template : VM_global_library.vm
[ERROR] ResourceManager : unable to find resource 'VM_global_library.vm' in any resource loader.
[INFO] Velocimacro : error using  VM library template VM_global_library.vm : org.apache.velocity.exception.ResourceNotFoundException:
Unable to find resource 'VM_global_library.vm'
[INFO] Velocimacro :  VM library template macro registration complete.
[INFO] Velocimacro : allowInline = true : VMs can be defined inline in templates
[INFO] Velocimacro : allowInlineToOverride = false : VMs defined inline may NOT replace previous
VM definitions
[INFO] Velocimacro : allowInlineLocal = false : VMs defined inline will be  global in scope
if allowed.
[INFO] Velocimacro : initialization complete.
[INFO] Velocity successfully started.
[JENKINS] Archiving <https://builds.apache.org/job/ExtVal%20for%20JSF%201.2%20(deploy)/ws/trunk/pom.xml>
to /home/hudson/hudson/jobs/ExtVal for JSF 1.2 (deploy)/modules/org.apache.myfaces.extensions.validator$myfaces-extval-module/builds/2011-10-09_00-04-20/archive/org.apache.myfaces.extensions.validator/myfaces-extval-module/1.2.5-SNAPSHOT/myfaces-extval-module-1.2.5-SNAPSHOT.pom
[JENKINS] Archiving <https://builds.apache.org/job/ExtVal%20for%20JSF%201.2%20(deploy)/ws/trunk/target/myfaces-extval-module-1.2.5-SNAPSHOT-site.xml>
to /home/hudson/hudson/jobs/ExtVal for JSF 1.2 (deploy)/modules/org.apache.myfaces.extensions.validator$myfaces-extval-module/builds/2011-10-09_00-04-20/archive/org.apache.myfaces.extensions.validator/myfaces-extval-module/1.2.5-SNAPSHOT/myfaces-extval-module-1.2.5-SNAPSHOT-site.xml
[INFO] [checkstyle:checkstyle {execution: checkstyle}]
[INFO] Source directory does not exist - skipping report.
[INFO] [checkstyle:check {execution: verify-style}]
[INFO] Unable to perform checkstyle:check, unable to find checkstyle:checkstyle outputFile.
[INFO] [install:install {execution: default-install}]
[INFO] Installing <https://builds.apache.org/job/ExtVal%20for%20JSF%201.2%20(deploy)/ws/trunk/pom.xml>
to /home/hudson/.m2/repository/org/apache/myfaces/extensions/validator/myfaces-extval-module/1.2.5-SNAPSHOT/myfaces-extval-module-1.2.5-SNAPSHOT.pom
[INFO] ------------------------------------------------------------------------
[ERROR] BUILD ERROR
[INFO] ------------------------------------------------------------------------
[INFO] Error installing artifact's metadata: Error installing metadata: Error updating group
repository metadata

input contained no data
[INFO] ------------------------------------------------------------------------
[INFO] For more information, run Maven with the -e switch
[INFO] ------------------------------------------------------------------------
[INFO] Total time: 14 seconds
[INFO] Finished at: Sun Oct 09 00:05:02 UTC 2011
[INFO] Final Memory: 30M/211M
[INFO] ------------------------------------------------------------------------
Sending e-mails to: commits@myfaces.apache.org
channel stopped


Mime
View raw message