myfaces-commits mailing list archives

Site index · List index
Message view « Date » · « Thread »
Top « Date » · « Thread »
From Apache Jenkins Server <jenk...@builds.apache.org>
Subject Build failed in Jenkins: myfaces-trinidad-plugins-20x #333
Date Wed, 05 Oct 2011 15:43:19 GMT
See <https://builds.apache.org/job/myfaces-trinidad-plugins-20x/333/>

------------------------------------------
[...truncated 182 lines...]
[INFO] Installing <https://builds.apache.org/job/myfaces-trinidad-plugins-20x/ws/maven-javacc-plugin/target/maven-javacc-plugin-2.0.7-SNAPSHOT.jar>
to /home/hudson/.m2/repository/org/apache/myfaces/trinidadbuild/maven-javacc-plugin/2.0.7-SNAPSHOT/maven-javacc-plugin-2.0.7-SNAPSHOT.jar
[JENKINS] Archiving <https://builds.apache.org/job/myfaces-trinidad-plugins-20x/ws/maven-javacc-plugin/pom.xml>
to /home/hudson/hudson/jobs/myfaces-trinidad-plugins-20x/modules/org.apache.myfaces.trinidadbuild$maven-javacc-plugin/builds/2011-10-05_15-41-55/archive/org.apache.myfaces.trinidadbuild/maven-javacc-plugin/2.0.7-SNAPSHOT/maven-javacc-plugin-2.0.7-SNAPSHOT.pom
[JENKINS] Archiving <https://builds.apache.org/job/myfaces-trinidad-plugins-20x/ws/maven-javacc-plugin/target/maven-javacc-plugin-2.0.7-SNAPSHOT.jar>
to /home/hudson/hudson/jobs/myfaces-trinidad-plugins-20x/modules/org.apache.myfaces.trinidadbuild$maven-javacc-plugin/builds/2011-10-05_15-41-55/archive/org.apache.myfaces.trinidadbuild/maven-javacc-plugin/2.0.7-SNAPSHOT/maven-javacc-plugin-2.0.7-SNAPSHOT.jar
[INFO] ------------------------------------------------------------------------
[INFO] Building Apache Trinidad Maven i18n Plugin
[INFO]    task-segment: [install]
[INFO] ------------------------------------------------------------------------
[INFO] [enforcer:enforce {execution: enforce-versions}]
[INFO] [plugin:descriptor {execution: default-descriptor}]
[INFO] Using 2 extractors.
[INFO] Applying extractor for language: java
[INFO] Extractor for language: java found 2 mojo descriptors.
[INFO] Applying extractor for language: bsh
[INFO] Extractor for language: bsh found 0 mojo descriptors.
[INFO] [remote-resources:process {execution: default}]
[INFO] [resources:resources {execution: default-resources}]
[INFO] Using 'UTF-8' encoding to copy filtered resources.
[INFO] Copying 0 resource
[INFO] Copying 2 resources
[INFO] [compiler:compile {execution: default-compile}]
[INFO] Nothing to compile - all classes are up to date
[INFO] [resources:testResources {execution: default-testResources}]
[INFO] Using 'UTF-8' encoding to copy filtered resources.
[INFO] skip non existing resourceDirectory <https://builds.apache.org/job/myfaces-trinidad-plugins-20x/ws/maven-i18n-plugin/src/test/resources>
[INFO] Copying 2 resources
[INFO] [compiler:testCompile {execution: default-testCompile}]
[INFO] No sources to compile
[INFO] [surefire:test {execution: default-test}]
[INFO] Surefire report directory: <https://builds.apache.org/job/myfaces-trinidad-plugins-20x/ws/maven-i18n-plugin/target/surefire-reports>

-------------------------------------------------------
 T E S T S
-------------------------------------------------------
There are no tests to run.

Results :

Tests run: 0, Failures: 0, Errors: 0, Skipped: 0

[JENKINS] Recording test results
[INFO] [jar:jar {execution: default-jar}]
[INFO] Building jar: <https://builds.apache.org/job/myfaces-trinidad-plugins-20x/ws/maven-i18n-plugin/target/maven-i18n-plugin-2.0.7-SNAPSHOT.jar>
[INFO] [plugin:addPluginArtifactMetadata {execution: default-addPluginArtifactMetadata}]
[INFO] [install:install {execution: default-install}]
[INFO] Installing <https://builds.apache.org/job/myfaces-trinidad-plugins-20x/ws/maven-i18n-plugin/target/maven-i18n-plugin-2.0.7-SNAPSHOT.jar>
to /home/hudson/.m2/repository/org/apache/myfaces/trinidadbuild/maven-i18n-plugin/2.0.7-SNAPSHOT/maven-i18n-plugin-2.0.7-SNAPSHOT.jar
[JENKINS] Archiving <https://builds.apache.org/job/myfaces-trinidad-plugins-20x/ws/maven-i18n-plugin/pom.xml>
to /home/hudson/hudson/jobs/myfaces-trinidad-plugins-20x/modules/org.apache.myfaces.trinidadbuild$maven-i18n-plugin/builds/2011-10-05_15-41-55/archive/org.apache.myfaces.trinidadbuild/maven-i18n-plugin/2.0.7-SNAPSHOT/maven-i18n-plugin-2.0.7-SNAPSHOT.pom
[JENKINS] Archiving <https://builds.apache.org/job/myfaces-trinidad-plugins-20x/ws/maven-i18n-plugin/target/maven-i18n-plugin-2.0.7-SNAPSHOT.jar>
to /home/hudson/hudson/jobs/myfaces-trinidad-plugins-20x/modules/org.apache.myfaces.trinidadbuild$maven-i18n-plugin/builds/2011-10-05_15-41-55/archive/org.apache.myfaces.trinidadbuild/maven-i18n-plugin/2.0.7-SNAPSHOT/maven-i18n-plugin-2.0.7-SNAPSHOT.jar
[INFO] ------------------------------------------------------------------------
[INFO] Building Apache Trinidad Maven Javascript Plugin
[INFO]    task-segment: [install]
[INFO] ------------------------------------------------------------------------
[INFO] [enforcer:enforce {execution: enforce-versions}]
[WARNING] While downloading javacc:javacc:3.2
  This artifact has been relocated to net.java.dev.javacc:javacc:3.2.


[INFO] [javacc:generate {execution: default}]
[INFO] Nothing to process - all grammars are up to date
[INFO] [plugin:descriptor {execution: default-descriptor}]
[INFO] Using 'UTF-8' encoding to read mojo metadata.
[INFO] Applying mojo extractor for language: java
[INFO] Mojo extractor for language: java found 2 mojo descriptors.
[INFO] Applying mojo extractor for language: bsh
[INFO] Mojo extractor for language: bsh found 0 mojo descriptors.
[INFO] [remote-resources:process {execution: default}]
[INFO] [resources:resources {execution: default-resources}]
[INFO] Using 'UTF-8' encoding to copy filtered resources.
[INFO] Copying 0 resource
[INFO] Copying 2 resources
[INFO] [compiler:compile {execution: default-compile}]
[INFO] Compiling 6 source files to <https://builds.apache.org/job/myfaces-trinidad-plugins-20x/ws/maven-javascript-plugin/target/classes>
[INFO] [resources:testResources {execution: default-testResources}]
[INFO] Using 'UTF-8' encoding to copy filtered resources.
[INFO] skip non existing resourceDirectory <https://builds.apache.org/job/myfaces-trinidad-plugins-20x/ws/maven-javascript-plugin/src/test/resources>
[INFO] Copying 2 resources
[INFO] [compiler:testCompile {execution: default-testCompile}]
[INFO] No sources to compile
[INFO] [surefire:test {execution: default-test}]
[INFO] Surefire report directory: <https://builds.apache.org/job/myfaces-trinidad-plugins-20x/ws/maven-javascript-plugin/target/surefire-reports>

-------------------------------------------------------
 T E S T S
-------------------------------------------------------
There are no tests to run.

Results :

Tests run: 0, Failures: 0, Errors: 0, Skipped: 0

[JENKINS] Recording test results
[INFO] [jar:jar {execution: default-jar}]
[INFO] Building jar: <https://builds.apache.org/job/myfaces-trinidad-plugins-20x/ws/maven-javascript-plugin/target/maven-javascript-plugin-2.0.7-SNAPSHOT.jar>
[INFO] [plugin:addPluginArtifactMetadata {execution: default-addPluginArtifactMetadata}]
[INFO] [install:install {execution: default-install}]
[INFO] Installing <https://builds.apache.org/job/myfaces-trinidad-plugins-20x/ws/maven-javascript-plugin/target/maven-javascript-plugin-2.0.7-SNAPSHOT.jar>
to /home/hudson/.m2/repository/org/apache/myfaces/trinidadbuild/maven-javascript-plugin/2.0.7-SNAPSHOT/maven-javascript-plugin-2.0.7-SNAPSHOT.jar
[JENKINS] Archiving <https://builds.apache.org/job/myfaces-trinidad-plugins-20x/ws/maven-javascript-plugin/pom.xml>
to /home/hudson/hudson/jobs/myfaces-trinidad-plugins-20x/modules/org.apache.myfaces.trinidadbuild$maven-javascript-plugin/builds/2011-10-05_15-41-55/archive/org.apache.myfaces.trinidadbuild/maven-javascript-plugin/2.0.7-SNAPSHOT/maven-javascript-plugin-2.0.7-SNAPSHOT.pom
[JENKINS] Archiving <https://builds.apache.org/job/myfaces-trinidad-plugins-20x/ws/maven-javascript-plugin/target/maven-javascript-plugin-2.0.7-SNAPSHOT.jar>
to /home/hudson/hudson/jobs/myfaces-trinidad-plugins-20x/modules/org.apache.myfaces.trinidadbuild$maven-javascript-plugin/builds/2011-10-05_15-41-55/archive/org.apache.myfaces.trinidadbuild/maven-javascript-plugin/2.0.7-SNAPSHOT/maven-javascript-plugin-2.0.7-SNAPSHOT.jar
[INFO] ------------------------------------------------------------------------
[INFO] Building Apache Trinidad Maven XRTS Plugin
[INFO]    task-segment: [install]
[INFO] ------------------------------------------------------------------------
[INFO] [enforcer:enforce {execution: enforce-versions}]
[INFO] [plugin:descriptor {execution: default-descriptor}]
[INFO] Using 2 extractors.
[INFO] Applying extractor for language: java
[INFO] Extractor for language: java found 2 mojo descriptors.
[INFO] Applying extractor for language: bsh
[INFO] Extractor for language: bsh found 0 mojo descriptors.
[INFO] [remote-resources:process {execution: default}]
[INFO] [resources:resources {execution: default-resources}]
[INFO] Using 'UTF-8' encoding to copy filtered resources.
[INFO] Copying 0 resource
[INFO] Copying 2 resources
[INFO] [compiler:compile {execution: default-compile}]
[INFO] Nothing to compile - all classes are up to date
[INFO] [resources:testResources {execution: default-testResources}]
[INFO] Using 'UTF-8' encoding to copy filtered resources.
[INFO] skip non existing resourceDirectory <https://builds.apache.org/job/myfaces-trinidad-plugins-20x/ws/maven-xrts-plugin/src/test/resources>
[INFO] Copying 2 resources
[INFO] [compiler:testCompile {execution: default-testCompile}]
[INFO] No sources to compile
[INFO] [surefire:test {execution: default-test}]
[INFO] Surefire report directory: <https://builds.apache.org/job/myfaces-trinidad-plugins-20x/ws/maven-xrts-plugin/target/surefire-reports>

-------------------------------------------------------
 T E S T S
-------------------------------------------------------
There are no tests to run.

Results :

Tests run: 0, Failures: 0, Errors: 0, Skipped: 0

[JENKINS] Recording test results
[INFO] [jar:jar {execution: default-jar}]
[INFO] Building jar: <https://builds.apache.org/job/myfaces-trinidad-plugins-20x/ws/maven-xrts-plugin/target/maven-xrts-plugin-2.0.7-SNAPSHOT.jar>
[INFO] [plugin:addPluginArtifactMetadata {execution: default-addPluginArtifactMetadata}]
[INFO] [install:install {execution: default-install}]
[INFO] Installing <https://builds.apache.org/job/myfaces-trinidad-plugins-20x/ws/maven-xrts-plugin/target/maven-xrts-plugin-2.0.7-SNAPSHOT.jar>
to /home/hudson/.m2/repository/org/apache/myfaces/trinidadbuild/maven-xrts-plugin/2.0.7-SNAPSHOT/maven-xrts-plugin-2.0.7-SNAPSHOT.jar
[JENKINS] Archiving <https://builds.apache.org/job/myfaces-trinidad-plugins-20x/ws/maven-xrts-plugin/pom.xml>
to /home/hudson/hudson/jobs/myfaces-trinidad-plugins-20x/modules/org.apache.myfaces.trinidadbuild$maven-xrts-plugin/builds/2011-10-05_15-41-55/archive/org.apache.myfaces.trinidadbuild/maven-xrts-plugin/2.0.7-SNAPSHOT/maven-xrts-plugin-2.0.7-SNAPSHOT.pom
[JENKINS] Archiving <https://builds.apache.org/job/myfaces-trinidad-plugins-20x/ws/maven-xrts-plugin/target/maven-xrts-plugin-2.0.7-SNAPSHOT.jar>
to /home/hudson/hudson/jobs/myfaces-trinidad-plugins-20x/modules/org.apache.myfaces.trinidadbuild$maven-xrts-plugin/builds/2011-10-05_15-41-55/archive/org.apache.myfaces.trinidadbuild/maven-xrts-plugin/2.0.7-SNAPSHOT/maven-xrts-plugin-2.0.7-SNAPSHOT.jar
[INFO] ------------------------------------------------------------------------
[INFO] Building Apache Trinidad Maven Tag Documentation Report
[INFO]    task-segment: [install]
[INFO] ------------------------------------------------------------------------
[INFO] [enforcer:enforce {execution: enforce-versions}]
[INFO] [plugin:descriptor {execution: default-descriptor}]
[INFO] Using 'UTF-8' encoding to read mojo metadata.
[INFO] Applying mojo extractor for language: java
[INFO] Mojo extractor for language: java found 1 mojo descriptors.
[INFO] Applying mojo extractor for language: bsh
[INFO] Mojo extractor for language: bsh found 0 mojo descriptors.
[INFO] [remote-resources:process {execution: default}]
[INFO] [resources:resources {execution: default-resources}]
[INFO] Using 'UTF-8' encoding to copy filtered resources.
[INFO] Copying 0 resource
[INFO] Copying 2 resources
[INFO] [compiler:compile {execution: default-compile}]
[INFO] Nothing to compile - all classes are up to date
[INFO] [resources:testResources {execution: default-testResources}]
[INFO] Using 'UTF-8' encoding to copy filtered resources.
[INFO] skip non existing resourceDirectory <https://builds.apache.org/job/myfaces-trinidad-plugins-20x/ws/maven-tagdoc-plugin/src/test/resources>
[INFO] Copying 2 resources
[INFO] [compiler:testCompile {execution: default-testCompile}]
[INFO] No sources to compile
[INFO] [surefire:test {execution: default-test}]
[INFO] Surefire report directory: <https://builds.apache.org/job/myfaces-trinidad-plugins-20x/ws/maven-tagdoc-plugin/target/surefire-reports>

-------------------------------------------------------
 T E S T S
-------------------------------------------------------
There are no tests to run.

Results :

Tests run: 0, Failures: 0, Errors: 0, Skipped: 0

[JENKINS] Recording test results
[INFO] [jar:jar {execution: default-jar}]
[INFO] Building jar: <https://builds.apache.org/job/myfaces-trinidad-plugins-20x/ws/maven-tagdoc-plugin/target/maven-tagdoc-plugin-2.0.7-SNAPSHOT.jar>
[INFO] [plugin:addPluginArtifactMetadata {execution: default-addPluginArtifactMetadata}]
[INFO] [install:install {execution: default-install}]
[INFO] Installing <https://builds.apache.org/job/myfaces-trinidad-plugins-20x/ws/maven-tagdoc-plugin/target/maven-tagdoc-plugin-2.0.7-SNAPSHOT.jar>
to /home/hudson/.m2/repository/org/apache/myfaces/trinidadbuild/maven-tagdoc-plugin/2.0.7-SNAPSHOT/maven-tagdoc-plugin-2.0.7-SNAPSHOT.jar
[JENKINS] Archiving <https://builds.apache.org/job/myfaces-trinidad-plugins-20x/ws/maven-tagdoc-plugin/pom.xml>
to /home/hudson/hudson/jobs/myfaces-trinidad-plugins-20x/modules/org.apache.myfaces.trinidadbuild$maven-tagdoc-plugin/builds/2011-10-05_15-41-55/archive/org.apache.myfaces.trinidadbuild/maven-tagdoc-plugin/2.0.7-SNAPSHOT/maven-tagdoc-plugin-2.0.7-SNAPSHOT.pom
[JENKINS] Archiving <https://builds.apache.org/job/myfaces-trinidad-plugins-20x/ws/maven-tagdoc-plugin/target/maven-tagdoc-plugin-2.0.7-SNAPSHOT.jar>
to /home/hudson/hudson/jobs/myfaces-trinidad-plugins-20x/modules/org.apache.myfaces.trinidadbuild$maven-tagdoc-plugin/builds/2011-10-05_15-41-55/archive/org.apache.myfaces.trinidadbuild/maven-tagdoc-plugin/2.0.7-SNAPSHOT/maven-tagdoc-plugin-2.0.7-SNAPSHOT.jar
[INFO] 
[INFO] 
[INFO] ------------------------------------------------------------------------
[INFO] Reactor Summary:
[INFO] ------------------------------------------------------------------------
[INFO] Apache Trinidad Maven Plugin Parent ................... SUCCESS [7.940s]
[INFO] Apache Trinidad Maven JDev Plugin ..................... SUCCESS [4.976s]
[INFO] Apache Trinidad Maven Faces Plugin .................... SUCCESS [20.767s]
[INFO] Apache Trinidad Maven Javacc Plugin ................... SUCCESS [1.826s]
[INFO] Apache Trinidad Maven i18n Plugin ..................... SUCCESS [2.086s]
[INFO] Apache Trinidad Maven Javascript Plugin ............... SUCCESS [3.665s]
[INFO] Apache Trinidad Maven XRTS Plugin ..................... SUCCESS [1.747s]
[INFO] Apache Trinidad Maven Tag Documentation Report ........ SUCCESS [1.516s]
[INFO] ------------------------------------------------------------------------
[INFO] ------------------------------------------------------------------------
[INFO] BUILD SUCCESSFUL
[INFO] ------------------------------------------------------------------------
[INFO] Total time: 56 seconds
[INFO] Finished at: Wed Oct 05 15:43:17 UTC 2011
[INFO] Final Memory: 43M/349M
[INFO] ------------------------------------------------------------------------
channel stopped
Maven RedeployPublished use remote ubuntu2 maven settings from : /home/hudson/.m2/settings.xml
[INFO] Deployment in https://repository.apache.org/content/repositories/snapshots/ (id=,uniqueVersion=true)
Deploying the main artifact maven-faces-plugin-2.0.7-SNAPSHOT.jar
Downloading: https://repository.apache.org/content/repositories/snapshots/org/apache/myfaces/trinidadbuild/maven-faces-plugin/2.0.7-SNAPSHOT/maven-metadata.xml
Downloaded: https://repository.apache.org/content/repositories/snapshots/org/apache/myfaces/trinidadbuild/maven-faces-plugin/2.0.7-SNAPSHOT/maven-metadata.xml
(296 B at 0.6 KB/sec)
Uploading: https://repository.apache.org/content/repositories/snapshots/org/apache/myfaces/trinidadbuild/maven-faces-plugin/2.0.7-SNAPSHOT/maven-faces-plugin-2.0.7-20111005.154319-1.jar
Uploading: https://repository.apache.org/content/repositories/snapshots/org/apache/myfaces/trinidadbuild/maven-faces-plugin/2.0.7-SNAPSHOT/maven-faces-plugin-2.0.7-20111005.154319-1.pom
ERROR: Failed to deploy artifacts: Could not transfer artifact org.apache.myfaces.trinidadbuild:maven-faces-plugin:jar:2.0.7-20111005.154319-1
from/to  (https://repository.apache.org/content/repositories/snapshots/): Failed to transfer
file: https://repository.apache.org/content/repositories/snapshots//org/apache/myfaces/trinidadbuild/maven-faces-plugin/2.0.7-SNAPSHOT/maven-faces-plugin-2.0.7-20111005.154319-1.jar.
Return code is: 401
org.apache.maven.artifact.deployer.ArtifactDeploymentException: Failed to deploy artifacts:
Could not transfer artifact org.apache.myfaces.trinidadbuild:maven-faces-plugin:jar:2.0.7-20111005.154319-1
from/to  (https://repository.apache.org/content/repositories/snapshots/): Failed to transfer
file: https://repository.apache.org/content/repositories/snapshots//org/apache/myfaces/trinidadbuild/maven-faces-plugin/2.0.7-SNAPSHOT/maven-faces-plugin-2.0.7-20111005.154319-1.jar.
Return code is: 401
	at org.apache.maven.artifact.deployer.DefaultArtifactDeployer.deploy(DefaultArtifactDeployer.java:141)
	at hudson.maven.reporters.MavenArtifactRecord.deploy(MavenArtifactRecord.java:189)
	at hudson.maven.RedeployPublisher.perform(RedeployPublisher.java:158)
	at hudson.tasks.BuildStepMonitor$1.perform(BuildStepMonitor.java:19)
	at hudson.model.AbstractBuild$AbstractRunner.perform(AbstractBuild.java:693)
	at hudson.model.AbstractBuild$AbstractRunner.performAllBuildSteps(AbstractBuild.java:668)
	at hudson.maven.MavenModuleSetBuild$RunnerImpl.post2(MavenModuleSetBuild.java:953)
	at hudson.model.AbstractBuild$AbstractRunner.post(AbstractBuild.java:615)
	at hudson.model.Run.run(Run.java:1401)
	at hudson.maven.MavenModuleSetBuild.run(MavenModuleSetBuild.java:474)
	at hudson.model.ResourceController.execute(ResourceController.java:88)
	at hudson.model.Executor.run(Executor.java:230)
Caused by: org.sonatype.aether.deployment.DeploymentException: Failed to deploy artifacts:
Could not transfer artifact org.apache.myfaces.trinidadbuild:maven-faces-plugin:jar:2.0.7-20111005.154319-1
from/to  (https://repository.apache.org/content/repositories/snapshots/): Failed to transfer
file: https://repository.apache.org/content/repositories/snapshots//org/apache/myfaces/trinidadbuild/maven-faces-plugin/2.0.7-SNAPSHOT/maven-faces-plugin-2.0.7-20111005.154319-1.jar.
Return code is: 401
	at org.sonatype.aether.impl.internal.DefaultDeployer.deploy(DefaultDeployer.java:284)
	at org.sonatype.aether.impl.internal.DefaultDeployer.deploy(DefaultDeployer.java:215)
	at org.sonatype.aether.impl.internal.DefaultRepositorySystem.deploy(DefaultRepositorySystem.java:480)
	at org.apache.maven.artifact.deployer.DefaultArtifactDeployer.deploy(DefaultArtifactDeployer.java:137)
	... 11 more
Caused by: org.sonatype.aether.transfer.ArtifactTransferException: Could not transfer artifact
org.apache.myfaces.trinidadbuild:maven-faces-plugin:jar:2.0.7-20111005.154319-1 from/to  (https://repository.apache.org/content/repositories/snapshots/):
Failed to transfer file: https://repository.apache.org/content/repositories/snapshots//org/apache/myfaces/trinidadbuild/maven-faces-plugin/2.0.7-SNAPSHOT/maven-faces-plugin-2.0.7-20111005.154319-1.jar.
Return code is: 401
	at org.sonatype.aether.connector.wagon.WagonRepositoryConnector$4.wrap(WagonRepositoryConnector.java:949)
	at org.sonatype.aether.connector.wagon.WagonRepositoryConnector$4.wrap(WagonRepositoryConnector.java:940)
	at org.sonatype.aether.connector.wagon.WagonRepositoryConnector$PutTask.flush(WagonRepositoryConnector.java:864)
	at org.sonatype.aether.connector.wagon.WagonRepositoryConnector.put(WagonRepositoryConnector.java:466)
	at org.sonatype.aether.impl.internal.DefaultDeployer.deploy(DefaultDeployer.java:278)
	... 14 more
Caused by: org.apache.maven.wagon.TransferFailedException: Failed to transfer file: https://repository.apache.org/content/repositories/snapshots//org/apache/myfaces/trinidadbuild/maven-faces-plugin/2.0.7-SNAPSHOT/maven-faces-plugin-2.0.7-20111005.154319-1.jar.
Return code is: 401
	at org.apache.maven.wagon.shared.http.AbstractHttpClientWagon.put(AbstractHttpClientWagon.java:368)
	at org.apache.maven.wagon.shared.http.AbstractHttpClientWagon.put(AbstractHttpClientWagon.java:280)
	at org.sonatype.aether.connector.wagon.WagonRepositoryConnector$PutTask.run(WagonRepositoryConnector.java:825)
	at org.sonatype.aether.connector.wagon.WagonRepositoryConnector.put(WagonRepositoryConnector.java:465)
	... 15 more
[INFO] Deployment failed after 1 sec
Build step 'Deploy artifacts to Maven repository' changed build result to FAILURE


Mime
View raw message