myfaces-commits mailing list archives

Site index · List index
Message view « Date » · « Thread »
Top « Date » · « Thread »
From Apache Jenkins Server <jenk...@builds.apache.org>
Subject Build failed in Jenkins: myfaces-trinidad-core-1.2 #412
Date Wed, 05 Oct 2011 16:04:11 GMT
See <https://builds.apache.org/job/myfaces-trinidad-core-1.2/412/>

------------------------------------------
[...truncated 9145 lines...]

-------------------------------------------------------
 T E S T S
-------------------------------------------------------
There are no tests to run.

Results :

Tests run: 0, Failures: 0, Errors: 0, Skipped: 0

[JENKINS] Recording test results
[INFO] [war:war {execution: default-war}]
[INFO] Packaging webapp
[INFO] Assembling webapp[trinidad-demo] in [<https://builds.apache.org/job/myfaces-trinidad-core-1.2/ws/trinidad-examples/trinidad-demo/target/trinidad-demo-1.2.16-SNAPSHOT]>
[INFO] Dependency[Dependency {groupId=javax.mail, artifactId=mail, version=1.4.1, type=jar}]
has changed (was Dependency {groupId=javax.mail, artifactId=mail, version=1.4.1, type=jar}).
[INFO] Dependency[Dependency {groupId=javax.activation, artifactId=activation, version=1.1,
type=jar}] has changed (was Dependency {groupId=javax.activation, artifactId=activation, version=1.1,
type=jar}).
[INFO] Dependency[Dependency {groupId=commons-lang, artifactId=commons-lang, version=2.4,
type=jar}] has changed (was Dependency {groupId=commons-lang, artifactId=commons-lang, version=2.4,
type=jar}).
[INFO] Dependency[Dependency {groupId=org.apache.myfaces.trinidad, artifactId=trinidad-api,
version=1.2.16-SNAPSHOT, type=jar}] has changed (was Dependency {groupId=org.apache.myfaces.trinidad,
artifactId=trinidad-api, version=1.2.16-SNAPSHOT, type=jar}).
[INFO] Dependency[Dependency {groupId=org.apache.myfaces.trinidad, artifactId=trinidad-impl,
version=1.2.16-SNAPSHOT, type=jar}] has changed (was Dependency {groupId=org.apache.myfaces.trinidad,
artifactId=trinidad-impl, version=1.2.16-SNAPSHOT, type=jar}).
[INFO] Processing war project
[INFO] Copying webapp resources[<https://builds.apache.org/job/myfaces-trinidad-core-1.2/ws/trinidad-examples/trinidad-demo/src/main/webapp]>
[INFO] Webapp assembled in[143 msecs]
[INFO] Building war: <https://builds.apache.org/job/myfaces-trinidad-core-1.2/ws/trinidad-examples/trinidad-demo/target/trinidad-demo-1.2.16-SNAPSHOT.war>
[INFO] Preparing source:jar
[WARNING] Removing: jar from forked lifecycle, to prevent recursive invocation.
[JENKINS] Re-archiving <https://builds.apache.org/job/myfaces-trinidad-core-1.2/ws/trinidad-examples/trinidad-demo/target/trinidad-demo-1.2.16-SNAPSHOT.war>
[JENKINS] Archiving <https://builds.apache.org/job/myfaces-trinidad-core-1.2/ws/trinidad-examples/trinidad-demo/target/trinidad-demo-1.2.16-SNAPSHOT-sources.jar>
to /home/hudson/hudson/jobs/myfaces-trinidad-core-1.2/modules/org.apache.myfaces.trinidad$trinidad-demo/builds/2011-10-05_15-51-44/archive/org.apache.myfaces.trinidad/trinidad-demo/1.2.16-SNAPSHOT/trinidad-demo-1.2.16-SNAPSHOT-sources.jar
[INFO] [xrts:generate-sources {execution: default}]
[INFO] [source:jar {execution: attach-source}]
[INFO] META-INF already added, skipping
[INFO] META-INF/LICENSE already added, skipping
[INFO] META-INF/NOTICE already added, skipping
[INFO] META-INF already added, skipping
[INFO] META-INF already added, skipping
[INFO] META-INF/LICENSE already added, skipping
[INFO] META-INF/NOTICE already added, skipping
[INFO] META-INF already added, skipping
[INFO] META-INF/LICENSE already added, skipping
[INFO] META-INF/NOTICE already added, skipping
[INFO] [install:install {execution: default-install}]
[INFO] Installing <https://builds.apache.org/job/myfaces-trinidad-core-1.2/ws/trinidad-examples/trinidad-demo/target/trinidad-demo-1.2.16-SNAPSHOT.war>
to /home/hudson/.m2/repository/org/apache/myfaces/trinidad/trinidad-demo/1.2.16-SNAPSHOT/trinidad-demo-1.2.16-SNAPSHOT.war
[INFO] Installing <https://builds.apache.org/job/myfaces-trinidad-core-1.2/ws/trinidad-examples/trinidad-demo/target/trinidad-demo-1.2.16-SNAPSHOT-sources.jar>
to /home/hudson/.m2/repository/org/apache/myfaces/trinidad/trinidad-demo/1.2.16-SNAPSHOT/trinidad-demo-1.2.16-SNAPSHOT-sources.jar
[INFO] Installing <https://builds.apache.org/job/myfaces-trinidad-core-1.2/ws/trinidad-examples/trinidad-demo/target/trinidad-demo-1.2.16-SNAPSHOT-sources.jar>
to /home/hudson/.m2/repository/org/apache/myfaces/trinidad/trinidad-demo/1.2.16-SNAPSHOT/trinidad-demo-1.2.16-SNAPSHOT-sources.jar
[INFO] [deploy:deploy {execution: default-deploy}]
[INFO] Retrieving previous build number from apache.snapshots.https
Uploading: https://repository.apache.org/content/repositories/snapshots/org/apache/myfaces/trinidad/trinidad-demo/1.2.16-SNAPSHOT/trinidad-demo-1.2.16-20111005.155220-37.war
6755K uploaded  (trinidad-demo-1.2.16-20111005.155220-37.war)
[INFO] Retrieving previous metadata from apache.snapshots.https
[INFO] Uploading repository metadata for: 'artifact org.apache.myfaces.trinidad:trinidad-demo'
[INFO] Retrieving previous metadata from apache.snapshots.https
[INFO] Uploading repository metadata for: 'snapshot org.apache.myfaces.trinidad:trinidad-demo:1.2.16-SNAPSHOT'
[INFO] Uploading project information for trinidad-demo 1.2.16-20111005.155220-37
[INFO] Retrieving previous build number from apache.snapshots.https
Uploading: https://repository.apache.org/content/repositories/snapshots/org/apache/myfaces/trinidad/trinidad-demo/1.2.16-SNAPSHOT/trinidad-demo-1.2.16-20111005.155220-37-sources.jar
135K uploaded  (trinidad-demo-1.2.16-20111005.155220-37-sources.jar)
[INFO] Retrieving previous build number from apache.snapshots.https
Uploading: https://repository.apache.org/content/repositories/snapshots/org/apache/myfaces/trinidad/trinidad-demo/1.2.16-SNAPSHOT/trinidad-demo-1.2.16-20111005.155220-37-sources.jar
135K uploaded  (trinidad-demo-1.2.16-20111005.155220-37-sources.jar)
[JENKINS] Archiving <https://builds.apache.org/job/myfaces-trinidad-core-1.2/ws/trinidad-examples/trinidad-demo/target/trinidad-demo-1.2.16-SNAPSHOT.war>
to /home/hudson/hudson/jobs/myfaces-trinidad-core-1.2/modules/org.apache.myfaces.trinidad$trinidad-demo/builds/2011-10-05_15-51-44/archive/org.apache.myfaces.trinidad/trinidad-demo/1.2.16-20111005.155220-37/trinidad-demo-1.2.16-20111005.155220-37.war
[JENKINS] Archiving <https://builds.apache.org/job/myfaces-trinidad-core-1.2/ws/trinidad-examples/trinidad-demo/target/trinidad-demo-1.2.16-SNAPSHOT-sources.jar>
to /home/hudson/hudson/jobs/myfaces-trinidad-core-1.2/modules/org.apache.myfaces.trinidad$trinidad-demo/builds/2011-10-05_15-51-44/archive/org.apache.myfaces.trinidad/trinidad-demo/1.2.16-20111005.155220-37/trinidad-demo-1.2.16-20111005.155220-37-sources.jar
[INFO] ------------------------------------------------------------------------
[INFO] Building Apache MyFaces Trinidad Components Showcase
[INFO]    task-segment: [clean, install, deploy]
[INFO] ------------------------------------------------------------------------
[INFO] snapshot org.apache.maven.plugins:maven-eclipse-plugin:2.9-SNAPSHOT: checking for updates
from apache.snapshots
[INFO] snapshot org.apache.maven.plugins:maven-idea-plugin:2.3-SNAPSHOT: checking for updates
from apache.snapshots
[INFO] [clean:clean {execution: default-clean}]
[INFO] Deleting <https://builds.apache.org/job/myfaces-trinidad-core-1.2/ws/trinidad-examples/trinidad-components-showcase/target>
[INFO] [xrts:generate-sources {execution: default}]
[INFO] [remote-resources:process {execution: default}]
[INFO] [resources:resources {execution: default-resources}]
[INFO] Using 'UTF-8' encoding to copy filtered resources.
[INFO] Copying 1 resource
[INFO] Copying 2 resources
[INFO] [compiler:compile {execution: default-compile}]
[INFO] Compiling 148 source files to <https://builds.apache.org/job/myfaces-trinidad-core-1.2/ws/trinidad-examples/trinidad-components-showcase/target/classes>
[INFO] [xrts:generate-test-sources {execution: default}]
[INFO] [resources:testResources {execution: default-testResources}]
[INFO] Using 'UTF-8' encoding to copy filtered resources.
[INFO] skip non existing resourceDirectory <https://builds.apache.org/job/myfaces-trinidad-core-1.2/ws/trinidad-examples/trinidad-components-showcase/src/test/resources>
[INFO] Copying 2 resources
[INFO] [compiler:testCompile {execution: default-testCompile}]
[INFO] No sources to compile
[INFO] [surefire:test {execution: default-test}]
[INFO] Surefire report directory: <https://builds.apache.org/job/myfaces-trinidad-core-1.2/ws/trinidad-examples/trinidad-components-showcase/target/surefire-reports>

-------------------------------------------------------
 T E S T S
-------------------------------------------------------
There are no tests to run.

Results :

Tests run: 0, Failures: 0, Errors: 0, Skipped: 0

[JENKINS] Recording test results
[INFO] [war:war {execution: default-war}]
[INFO] Packaging webapp
[INFO] Assembling webapp[trinidad-components-showcase] in [<https://builds.apache.org/job/myfaces-trinidad-core-1.2/ws/trinidad-examples/trinidad-components-showcase/target/trinidad-components-showcase-1.2.16-SNAPSHOT]>
[INFO] Processing war project
[INFO] Copying webapp webResources[<https://builds.apache.org/job/myfaces-trinidad-core-1.2/ws/trinidad-examples/trinidad-components-showcase/src/main/java]>
to[<https://builds.apache.org/job/myfaces-trinidad-core-1.2/ws/trinidad-examples/trinidad-components-showcase/target/trinidad-components-showcase-1.2.16-SNAPSHOT]>
[INFO] Copying webapp resources[<https://builds.apache.org/job/myfaces-trinidad-core-1.2/ws/trinidad-examples/trinidad-components-showcase/src/main/webapp]>
[INFO] Webapp assembled in[2798 msecs]
[INFO] Building war: <https://builds.apache.org/job/myfaces-trinidad-core-1.2/ws/trinidad-examples/trinidad-components-showcase/target/trinidad-components-showcase-1.2.16-SNAPSHOT.war>
[INFO] Preparing source:jar
[WARNING] Removing: jar from forked lifecycle, to prevent recursive invocation.
[JENKINS] Archiving <https://builds.apache.org/job/myfaces-trinidad-core-1.2/ws/trinidad-examples/trinidad-components-showcase/pom.xml>
to /home/hudson/hudson/jobs/myfaces-trinidad-core-1.2/modules/org.apache.myfaces.trinidad$trinidad-components-showcase/builds/2011-10-05_15-51-44/archive/org.apache.myfaces.trinidad/trinidad-components-showcase/1.2.16-SNAPSHOT/trinidad-components-showcase-1.2.16-SNAPSHOT.pom
[JENKINS] Archiving <https://builds.apache.org/job/myfaces-trinidad-core-1.2/ws/trinidad-examples/trinidad-components-showcase/target/trinidad-components-showcase-1.2.16-SNAPSHOT.war>
to /home/hudson/hudson/jobs/myfaces-trinidad-core-1.2/modules/org.apache.myfaces.trinidad$trinidad-components-showcase/builds/2011-10-05_15-51-44/archive/org.apache.myfaces.trinidad/trinidad-components-showcase/1.2.16-SNAPSHOT/trinidad-components-showcase-1.2.16-SNAPSHOT.war
[INFO] [xrts:generate-sources {execution: default}]
[INFO] [source:jar {execution: attach-source}]
[INFO] META-INF already added, skipping
[INFO] META-INF already added, skipping
[INFO] META-INF/LICENSE already added, skipping
[INFO] META-INF/NOTICE already added, skipping
[INFO] Building jar: <https://builds.apache.org/job/myfaces-trinidad-core-1.2/ws/trinidad-examples/trinidad-components-showcase/target/trinidad-components-showcase-1.2.16-SNAPSHOT-sources.jar>
[INFO] META-INF already added, skipping
[INFO] META-INF already added, skipping
[INFO] META-INF/LICENSE already added, skipping
[INFO] META-INF/NOTICE already added, skipping
[INFO] [install:install {execution: default-install}]
[INFO] Installing <https://builds.apache.org/job/myfaces-trinidad-core-1.2/ws/trinidad-examples/trinidad-components-showcase/target/trinidad-components-showcase-1.2.16-SNAPSHOT.war>
to /home/hudson/.m2/repository/org/apache/myfaces/trinidad/trinidad-components-showcase/1.2.16-SNAPSHOT/trinidad-components-showcase-1.2.16-SNAPSHOT.war
[INFO] Installing <https://builds.apache.org/job/myfaces-trinidad-core-1.2/ws/trinidad-examples/trinidad-components-showcase/target/trinidad-components-showcase-1.2.16-SNAPSHOT-sources.jar>
to /home/hudson/.m2/repository/org/apache/myfaces/trinidad/trinidad-components-showcase/1.2.16-SNAPSHOT/trinidad-components-showcase-1.2.16-SNAPSHOT-sources.jar
[INFO] [xrts:generate-sources {execution: default}]
[INFO] [remote-resources:process {execution: default}]
[INFO] [resources:resources {execution: default-resources}]
[INFO] Using 'UTF-8' encoding to copy filtered resources.
[INFO] Copying 1 resource
[INFO] Copying 2 resources
[INFO] Copying 2 resources
[INFO] [compiler:compile {execution: default-compile}]
[INFO] Nothing to compile - all classes are up to date
[INFO] [xrts:generate-test-sources {execution: default}]
[INFO] [resources:testResources {execution: default-testResources}]
[INFO] Using 'UTF-8' encoding to copy filtered resources.
[INFO] skip non existing resourceDirectory <https://builds.apache.org/job/myfaces-trinidad-core-1.2/ws/trinidad-examples/trinidad-components-showcase/src/test/resources>
[INFO] Copying 2 resources
[INFO] Copying 2 resources
[INFO] [compiler:testCompile {execution: default-testCompile}]
[INFO] No sources to compile
[INFO] [surefire:test {execution: default-test}]
[INFO] Surefire report directory: <https://builds.apache.org/job/myfaces-trinidad-core-1.2/ws/trinidad-examples/trinidad-components-showcase/target/surefire-reports>

-------------------------------------------------------
 T E S T S
-------------------------------------------------------
There are no tests to run.

Results :

Tests run: 0, Failures: 0, Errors: 0, Skipped: 0

[JENKINS] Recording test results
[INFO] [war:war {execution: default-war}]
[INFO] Packaging webapp
[INFO] Assembling webapp[trinidad-components-showcase] in [<https://builds.apache.org/job/myfaces-trinidad-core-1.2/ws/trinidad-examples/trinidad-components-showcase/target/trinidad-components-showcase-1.2.16-SNAPSHOT]>
[INFO] Dependency[Dependency {groupId=com.sun.facelets, artifactId=jsf-facelets, version=1.1.14,
type=jar}] has changed (was Dependency {groupId=com.sun.facelets, artifactId=jsf-facelets,
version=1.1.14, type=jar}).
[INFO] Dependency[Dependency {groupId=com.uwyn, artifactId=jhighlight, version=1.0, type=jar}]
has changed (was Dependency {groupId=com.uwyn, artifactId=jhighlight, version=1.0, type=jar}).
[INFO] Dependency[Dependency {groupId=org.apache.myfaces.trinidad, artifactId=trinidad-api,
version=1.2.16-SNAPSHOT, type=jar}] has changed (was Dependency {groupId=org.apache.myfaces.trinidad,
artifactId=trinidad-api, version=1.2.16-SNAPSHOT, type=jar}).
[INFO] Dependency[Dependency {groupId=org.apache.myfaces.trinidad, artifactId=trinidad-impl,
version=1.2.16-SNAPSHOT, type=jar}] has changed (was Dependency {groupId=org.apache.myfaces.trinidad,
artifactId=trinidad-impl, version=1.2.16-SNAPSHOT, type=jar}).
[INFO] Processing war project
[INFO] Copying webapp webResources[<https://builds.apache.org/job/myfaces-trinidad-core-1.2/ws/trinidad-examples/trinidad-components-showcase/src/main/java]>
to[<https://builds.apache.org/job/myfaces-trinidad-core-1.2/ws/trinidad-examples/trinidad-components-showcase/target/trinidad-components-showcase-1.2.16-SNAPSHOT]>
[INFO] Copying webapp resources[<https://builds.apache.org/job/myfaces-trinidad-core-1.2/ws/trinidad-examples/trinidad-components-showcase/src/main/webapp]>
[INFO] Webapp assembled in[350 msecs]
[INFO] Building war: <https://builds.apache.org/job/myfaces-trinidad-core-1.2/ws/trinidad-examples/trinidad-components-showcase/target/trinidad-components-showcase-1.2.16-SNAPSHOT.war>
[INFO] Preparing source:jar
[WARNING] Removing: jar from forked lifecycle, to prevent recursive invocation.
[JENKINS] Re-archiving <https://builds.apache.org/job/myfaces-trinidad-core-1.2/ws/trinidad-examples/trinidad-components-showcase/target/trinidad-components-showcase-1.2.16-SNAPSHOT.war>
[JENKINS] Archiving <https://builds.apache.org/job/myfaces-trinidad-core-1.2/ws/trinidad-examples/trinidad-components-showcase/target/trinidad-components-showcase-1.2.16-SNAPSHOT-sources.jar>
to /home/hudson/hudson/jobs/myfaces-trinidad-core-1.2/modules/org.apache.myfaces.trinidad$trinidad-components-showcase/builds/2011-10-05_15-51-44/archive/org.apache.myfaces.trinidad/trinidad-components-showcase/1.2.16-SNAPSHOT/trinidad-components-showcase-1.2.16-SNAPSHOT-sources.jar
[INFO] [xrts:generate-sources {execution: default}]
[INFO] [source:jar {execution: attach-source}]
[INFO] META-INF already added, skipping
[INFO] META-INF/LICENSE already added, skipping
[INFO] META-INF/NOTICE already added, skipping
[INFO] META-INF already added, skipping
[INFO] META-INF already added, skipping
[INFO] META-INF/LICENSE already added, skipping
[INFO] META-INF/NOTICE already added, skipping
[INFO] META-INF already added, skipping
[INFO] META-INF/LICENSE already added, skipping
[INFO] META-INF/NOTICE already added, skipping
[INFO] [install:install {execution: default-install}]
[INFO] Installing <https://builds.apache.org/job/myfaces-trinidad-core-1.2/ws/trinidad-examples/trinidad-components-showcase/target/trinidad-components-showcase-1.2.16-SNAPSHOT.war>
to /home/hudson/.m2/repository/org/apache/myfaces/trinidad/trinidad-components-showcase/1.2.16-SNAPSHOT/trinidad-components-showcase-1.2.16-SNAPSHOT.war
[INFO] Installing <https://builds.apache.org/job/myfaces-trinidad-core-1.2/ws/trinidad-examples/trinidad-components-showcase/target/trinidad-components-showcase-1.2.16-SNAPSHOT-sources.jar>
to /home/hudson/.m2/repository/org/apache/myfaces/trinidad/trinidad-components-showcase/1.2.16-SNAPSHOT/trinidad-components-showcase-1.2.16-SNAPSHOT-sources.jar
[INFO] Installing <https://builds.apache.org/job/myfaces-trinidad-core-1.2/ws/trinidad-examples/trinidad-components-showcase/target/trinidad-components-showcase-1.2.16-SNAPSHOT-sources.jar>
to /home/hudson/.m2/repository/org/apache/myfaces/trinidad/trinidad-components-showcase/1.2.16-SNAPSHOT/trinidad-components-showcase-1.2.16-SNAPSHOT-sources.jar
[INFO] [deploy:deploy {execution: default-deploy}]
[INFO] Retrieving previous build number from apache.snapshots.https
Uploading: https://repository.apache.org/content/repositories/snapshots/org/apache/myfaces/trinidad/trinidad-components-showcase/1.2.16-SNAPSHOT/trinidad-components-showcase-1.2.16-20111005.155220-37.war
6885K uploaded  (trinidad-components-showcase-1.2.16-20111005.155220-37.war)
[INFO] Uploading project information for trinidad-components-showcase 1.2.16-20111005.155220-37
[INFO] Retrieving previous metadata from apache.snapshots.https
[INFO] Uploading repository metadata for: 'snapshot org.apache.myfaces.trinidad:trinidad-components-showcase:1.2.16-SNAPSHOT'
[INFO] Retrieving previous metadata from apache.snapshots.https
[INFO] Uploading repository metadata for: 'artifact org.apache.myfaces.trinidad:trinidad-components-showcase'
[INFO] Retrieving previous build number from apache.snapshots.https
Uploading: https://repository.apache.org/content/repositories/snapshots/org/apache/myfaces/trinidad/trinidad-components-showcase/1.2.16-SNAPSHOT/trinidad-components-showcase-1.2.16-20111005.155220-37-sources.jar
196K uploaded  (trinidad-components-showcase-1.2.16-20111005.155220-37-sources.jar)
[INFO] Retrieving previous build number from apache.snapshots.https
Uploading: https://repository.apache.org/content/repositories/snapshots/org/apache/myfaces/trinidad/trinidad-components-showcase/1.2.16-SNAPSHOT/trinidad-components-showcase-1.2.16-20111005.155220-37-sources.jar
196K uploaded  (trinidad-components-showcase-1.2.16-20111005.155220-37-sources.jar)
[JENKINS] Archiving <https://builds.apache.org/job/myfaces-trinidad-core-1.2/ws/trinidad-examples/trinidad-components-showcase/target/trinidad-components-showcase-1.2.16-SNAPSHOT.war>
to /home/hudson/hudson/jobs/myfaces-trinidad-core-1.2/modules/org.apache.myfaces.trinidad$trinidad-components-showcase/builds/2011-10-05_15-51-44/archive/org.apache.myfaces.trinidad/trinidad-components-showcase/1.2.16-20111005.155220-37/trinidad-components-showcase-1.2.16-20111005.155220-37.war
[JENKINS] Archiving <https://builds.apache.org/job/myfaces-trinidad-core-1.2/ws/trinidad-examples/trinidad-components-showcase/target/trinidad-components-showcase-1.2.16-SNAPSHOT-sources.jar>
to /home/hudson/hudson/jobs/myfaces-trinidad-core-1.2/modules/org.apache.myfaces.trinidad$trinidad-components-showcase/builds/2011-10-05_15-51-44/archive/org.apache.myfaces.trinidad/trinidad-components-showcase/1.2.16-20111005.155220-37/trinidad-components-showcase-1.2.16-20111005.155220-37-sources.jar
[INFO] 
[INFO] 
[INFO] ------------------------------------------------------------------------
[INFO] Reactor Summary:
[INFO] ------------------------------------------------------------------------
[INFO] Apache MyFaces Trinidad 1.2 ........................... SUCCESS [14.530s]
[INFO] Apache MyFaces Trinidad Build ......................... SUCCESS [22.068s]
[INFO] Apache MyFaces Trinidad API ........................... SUCCESS [1:21.900s]
[INFO] Apache MyFaces Trinidad Impl .......................... SUCCESS [3:00.393s]
[INFO] Apache MyFaces Trinidad Examples ...................... SUCCESS [3.889s]
[INFO] Apache MyFaces Trinidad Blank Demo .................... SUCCESS [1:04.015s]
[INFO] Apache MyFaces Trinidad Demo .......................... SUCCESS [1:31.067s]
[INFO] Apache MyFaces Trinidad Components Showcase ........... SUCCESS [1:33.667s]
[INFO] ------------------------------------------------------------------------
[INFO] ------------------------------------------------------------------------
[INFO] BUILD SUCCESSFUL
[INFO] ------------------------------------------------------------------------
[INFO] Total time: 12 minutes 1 second
[INFO] Finished at: Wed Oct 05 16:04:09 UTC 2011
[INFO] Final Memory: 76M/532M
[INFO] ------------------------------------------------------------------------
channel stopped
Maven RedeployPublished use remote ubuntu2 maven settings from : /home/hudson/.m2/settings.xml
[INFO] Deployment in https://repository.apache.org/content/repositories/snapshots (id=,uniqueVersion=false)
Deploying the main artifact trinidad-1.2.16-20111005.155220-43.pom
ERROR: Error deploying artifact: Failed to transfer file: https://repository.apache.org/content/repositories/snapshots/org/apache/myfaces/trinidad/trinidad/1.2.16-SNAPSHOT/trinidad-1.2.16-SNAPSHOT.pom.
Return code is: 401
org.apache.maven.artifact.deployer.ArtifactDeploymentException: Error deploying artifact:
Failed to transfer file: https://repository.apache.org/content/repositories/snapshots/org/apache/myfaces/trinidad/trinidad/1.2.16-SNAPSHOT/trinidad-1.2.16-SNAPSHOT.pom.
Return code is: 401
	at hudson.maven.artifact.deployer.DefaultArtifactDeployer.deploy(DefaultArtifactDeployer.java:175)
	at hudson.maven.reporters.MavenArtifactRecord.deploy(MavenArtifactRecord.java:189)
	at hudson.maven.RedeployPublisher.perform(RedeployPublisher.java:158)
	at hudson.tasks.BuildStepMonitor$1.perform(BuildStepMonitor.java:19)
	at hudson.model.AbstractBuild$AbstractRunner.perform(AbstractBuild.java:693)
	at hudson.model.AbstractBuild$AbstractRunner.performAllBuildSteps(AbstractBuild.java:668)
	at hudson.maven.MavenModuleSetBuild$RunnerImpl.post2(MavenModuleSetBuild.java:953)
	at hudson.model.AbstractBuild$AbstractRunner.post(AbstractBuild.java:615)
	at hudson.model.Run.run(Run.java:1401)
	at hudson.maven.MavenModuleSetBuild.run(MavenModuleSetBuild.java:474)
	at hudson.model.ResourceController.execute(ResourceController.java:88)
	at hudson.model.Executor.run(Executor.java:230)
Caused by: org.apache.maven.wagon.TransferFailedException: Failed to transfer file: https://repository.apache.org/content/repositories/snapshots/org/apache/myfaces/trinidad/trinidad/1.2.16-SNAPSHOT/trinidad-1.2.16-SNAPSHOT.pom.
Return code is: 401
	at org.apache.maven.wagon.shared.http.AbstractHttpClientWagon.put(AbstractHttpClientWagon.java:368)
	at org.apache.maven.wagon.shared.http.AbstractHttpClientWagon.put(AbstractHttpClientWagon.java:280)
	at org.apache.maven.repository.legacy.DefaultWagonManager.putRemoteFile(DefaultWagonManager.java:543)
	at org.apache.maven.repository.legacy.DefaultWagonManager.putArtifact(DefaultWagonManager.java:494)
	at hudson.maven.artifact.deployer.DefaultArtifactDeployer.deploy(DefaultArtifactDeployer.java:160)
	... 11 more
[INFO] Deployment failed after 0.44 sec
Build step 'Deploy artifacts to Maven repository' changed build result to FAILURE


Mime
View raw message