myfaces-commits mailing list archives

Site index · List index
Message view « Date » · « Thread »
Top « Date » · « Thread »
From Apache Jenkins Server <jenk...@builds.apache.org>
Subject Build failed in Jenkins: myfaces-maven2-plugins #162
Date Wed, 05 Oct 2011 17:03:22 GMT
See <https://builds.apache.org/job/myfaces-maven2-plugins/162/changes>

Changes:

[lu4242] MYFACES-3347 Improve web config param logging and enhance @JSFWebConfigParam

------------------------------------------
[...truncated 249 lines...]
[INFO] Building Apache MyFaces Buildtools Maven2 Javacc Plugin
[INFO]    task-segment: [install]
[INFO] ------------------------------------------------------------------------
[INFO] [antrun:run {execution: javadoc.resources}]
[INFO] Executing tasks
[INFO] Executed tasks
[INFO] [plugin:descriptor {execution: default-descriptor}]
[INFO] Using 'UTF-8' encoding to read mojo metadata.
[INFO] Applying mojo extractor for language: java
[INFO] Mojo extractor for language: java found 1 mojo descriptors.
[INFO] Applying mojo extractor for language: bsh
[INFO] Mojo extractor for language: bsh found 0 mojo descriptors.
[INFO] [remote-resources:process {execution: default}]
[INFO] [resources:resources {execution: default-resources}]
[INFO] Using 'UTF-8' encoding to copy filtered resources.
[INFO] Copying 0 resource
[INFO] Copying 3 resources
[INFO] [compiler:compile {execution: default-compile}]
[INFO] Nothing to compile - all classes are up to date
[INFO] [resources:testResources {execution: default-testResources}]
[INFO] Using 'UTF-8' encoding to copy filtered resources.
[INFO] Copying 8 resources
[INFO] Copying 3 resources
[INFO] [compiler:testCompile {execution: default-testCompile}]
[INFO] Nothing to compile - all classes are up to date
[INFO] [surefire:test {execution: default-test}]
[INFO] Surefire report directory: <https://builds.apache.org/job/myfaces-maven2-plugins/ws/maven2-plugins/myfaces-javacc-plugin/target/surefire-reports>

-------------------------------------------------------
 T E S T S
-------------------------------------------------------
Running org.apache.myfaces.buildtools.maven2.plugin.javacc.JavaCCMojoTest
Tests run: 1, Failures: 0, Errors: 0, Skipped: 0, Time elapsed: 0.035 sec

Results :

Tests run: 1, Failures: 0, Errors: 0, Skipped: 0

[JENKINS] Recording test results
[INFO] [jar:jar {execution: default-jar}]
[INFO] Building jar: <https://builds.apache.org/job/myfaces-maven2-plugins/ws/maven2-plugins/myfaces-javacc-plugin/target/myfaces-javacc-plugin-1.0.2-SNAPSHOT.jar>
[INFO] [plugin:addPluginArtifactMetadata {execution: default-addPluginArtifactMetadata}]
[INFO] [install:install {execution: default-install}]
[INFO] Installing <https://builds.apache.org/job/myfaces-maven2-plugins/ws/maven2-plugins/myfaces-javacc-plugin/target/myfaces-javacc-plugin-1.0.2-SNAPSHOT.jar>
to /home/jenkins/.m2/repository/org/apache/myfaces/buildtools/myfaces-javacc-plugin/1.0.2-SNAPSHOT/myfaces-javacc-plugin-1.0.2-SNAPSHOT.jar
[JENKINS] Archiving <https://builds.apache.org/job/myfaces-maven2-plugins/ws/maven2-plugins/myfaces-javacc-plugin/pom.xml>
to /home/hudson/hudson/jobs/myfaces-maven2-plugins/modules/org.apache.myfaces.buildtools$myfaces-javacc-plugin/builds/2011-10-05_17-01-45/archive/org.apache.myfaces.buildtools/myfaces-javacc-plugin/1.0.2-SNAPSHOT/myfaces-javacc-plugin-1.0.2-SNAPSHOT.pom
[JENKINS] Archiving <https://builds.apache.org/job/myfaces-maven2-plugins/ws/maven2-plugins/myfaces-javacc-plugin/target/myfaces-javacc-plugin-1.0.2-SNAPSHOT.jar>
to /home/hudson/hudson/jobs/myfaces-maven2-plugins/modules/org.apache.myfaces.buildtools$myfaces-javacc-plugin/builds/2011-10-05_17-01-45/archive/org.apache.myfaces.buildtools/myfaces-javacc-plugin/1.0.2-SNAPSHOT/myfaces-javacc-plugin-1.0.2-SNAPSHOT.jar
[INFO] ------------------------------------------------------------------------
[INFO] Building Apache MyFaces Buildtools Maven2 Javascript Plugin
[INFO]    task-segment: [install]
[INFO] ------------------------------------------------------------------------
[INFO] [antrun:run {execution: javadoc.resources}]
[INFO] Executing tasks
[INFO] Executed tasks
[WARNING] While downloading javacc:javacc:3.2
  This artifact has been relocated to net.java.dev.javacc:javacc:3.2.


[INFO] [myfaces-javacc:generate {execution: default}]
[INFO] Nothing to process - all grammars are up to date
[INFO] [modello:xpp3-reader {execution: descriptor}]
[INFO] outputDirectory: <https://builds.apache.org/job/myfaces-maven2-plugins/ws/maven2-plugins/myfaces-javascript-plugin/target/generated-sources/modello>
[INFO] Working on model: src/main/mdo/assembler.mdo
[INFO] Generating current version: 1.0.0
[INFO] [modello:java {execution: descriptor}]
[INFO] outputDirectory: <https://builds.apache.org/job/myfaces-maven2-plugins/ws/maven2-plugins/myfaces-javascript-plugin/target/generated-sources/modello>
[INFO] Working on model: src/main/mdo/assembler.mdo
[INFO] Generating current version: 1.0.0
[INFO] [modello:xsd {execution: descriptor}]
[INFO] outputDirectory: <https://builds.apache.org/job/myfaces-maven2-plugins/ws/maven2-plugins/myfaces-javascript-plugin/target/generated-site/xsd>
[INFO] Working on model: src/main/mdo/assembler.mdo
[INFO] Generating current version: 1.0.0
[INFO] [plugin:descriptor {execution: default-descriptor}]
[INFO] Using 'UTF-8' encoding to read mojo metadata.
[INFO] Applying mojo extractor for language: java
[INFO] Mojo extractor for language: java found 9 mojo descriptors.
[INFO] Applying mojo extractor for language: bsh
[INFO] Mojo extractor for language: bsh found 0 mojo descriptors.
[INFO] [remote-resources:process {execution: default}]
[INFO] [resources:resources {execution: default-resources}]
[INFO] Using 'UTF-8' encoding to copy filtered resources.
[INFO] Copying 1 resource
[INFO] Copying 3 resources
[INFO] [compiler:compile {execution: default-compile}]
[INFO] Compiling 9 source files to <https://builds.apache.org/job/myfaces-maven2-plugins/ws/maven2-plugins/myfaces-javascript-plugin/target/classes>
[INFO] [resources:testResources {execution: default-testResources}]
[INFO] Using 'UTF-8' encoding to copy filtered resources.
[INFO] Copying 26 resources
[INFO] Copying 3 resources
[INFO] [compiler:testCompile {execution: default-testCompile}]
[INFO] Nothing to compile - all classes are up to date
[INFO] [surefire:test {execution: default-test}]
[INFO] Surefire report directory: <https://builds.apache.org/job/myfaces-maven2-plugins/ws/maven2-plugins/myfaces-javascript-plugin/target/surefire-reports>

-------------------------------------------------------
 T E S T S
-------------------------------------------------------
Running org.apache.myfaces.buildtools.maven2.plugin.javascript.jmt.CompressMojoTest
[INFO] ------------------------------------------------------------------------------
[INFO] builder.js (4,268 bytes) ................................... compressed at 36%
[INFO] controls.js (28,803 bytes) ................................. compressed at 33%
[INFO] unittest.js (20,047 bytes) ................................. compressed at 25%
[INFO] scriptaculous.js (2,404 bytes) ............................. compressed at 64%
[INFO] dragdrop.js (31,513 bytes) ................................. compressed at 27%
[INFO] global.js (10,872 bytes) ................................... compressed at 17%
[INFO] slider.js (11,283 bytes) ................................... compressed at 32%
[INFO] effects.js (33,802 bytes) .................................. compressed at 24%
[INFO] ------------------------------------------------------------------------------
[INFO] compression saved 8,263 bytes
[INFO] Building jar: <https://builds.apache.org/job/myfaces-maven2-plugins/ws/maven2-plugins/myfaces-javascript-plugin/target/test-target/attach-compressed/scriptaculous-1.7-compressed.jar>
[INFO] ------------------------------------------------------------------------------
[INFO] builder.js (4,268 bytes) ................................... compressed at 36%
[INFO] controls.js (28,803 bytes) ................................. compressed at 33%
[INFO] unittest.js (20,047 bytes) ................................. compressed at 25%
[INFO] scriptaculous.js (2,404 bytes) ............................. compressed at 64%
[INFO] dragdrop.js (31,513 bytes) ................................. compressed at 27%
[INFO] global.js (10,872 bytes) ................................... compressed at 17%
[INFO] slider.js (11,283 bytes) ................................... compressed at 32%
[INFO] effects.js (33,802 bytes) .................................. compressed at 24%
[INFO] ------------------------------------------------------------------------------
[INFO] compression saved 8,263 bytes
[INFO] ------------------------------------------------------------------------------
[INFO] zero-length.js was zero length; not compressed.
[INFO] ------------------------------------------------------------------------------
[INFO] compression saved 0 bytes
Tests run: 3, Failures: 0, Errors: 0, Skipped: 0, Time elapsed: 1.336 sec
Running org.apache.myfaces.buildtools.maven2.plugin.javascript.jmt.compress.IsolatedClassLoaderTest
Tests run: 1, Failures: 0, Errors: 0, Skipped: 0, Time elapsed: 0.04 sec
Running org.apache.myfaces.buildtools.maven2.plugin.javascript.jmt.CompileMojoTest
[INFO] Reading assembler descriptor <https://builds.apache.org/job/myfaces-maven2-plugins/ws/maven2-plugins/myfaces-javascript-plugin/src/test/resources/assembler.xml>
Tests run: 1, Failures: 0, Errors: 0, Skipped: 0, Time elapsed: 0.072 sec
Running org.apache.myfaces.buildtools.maven2.plugin.javascript.jmt.StripDebugsMojoTest
[INFO] ------------------------------------------------------------------------------
[INFO] debugs.js (705 bytes) ...................................... compressed at 86%
[INFO] ------------------------------------------------------------------------------
[INFO] compression saved 608 bytes
Tests run: 1, Failures: 0, Errors: 0, Skipped: 0, Time elapsed: 0.046 sec
Running org.apache.myfaces.buildtools.maven2.plugin.javascript.jmt.assembler.JsBuilderAssemblerReaderTest
Tests run: 1, Failures: 0, Errors: 0, Skipped: 0, Time elapsed: 0.102 sec
Running org.apache.myfaces.buildtools.maven2.plugin.javascript.jmt.compress.YahooUICompressorTest
Tests run: 1, Failures: 0, Errors: 0, Skipped: 0, Time elapsed: 0.315 sec
Running org.apache.myfaces.buildtools.maven2.plugin.javascript.jmt.WarPackageMojoTest
[INFO] Unpack javascript dependency [org.prototypejs:prototype:javascript:1.5.1.1:runtime]
[INFO] Expanding: src/test/resources/prototype-1.5.1.1.jar into <https://builds.apache.org/job/myfaces-maven2-plugins/ws/maven2-plugins/myfaces-javascript-plugin/target/test-target/war-package/scripts/lib>
Tests run: 1, Failures: 0, Errors: 0, Skipped: 0, Time elapsed: 0.055 sec

Results :

Tests run: 9, Failures: 0, Errors: 0, Skipped: 0

[JENKINS] Recording test results
[INFO] [jar:jar {execution: default-jar}]
[INFO] Building jar: <https://builds.apache.org/job/myfaces-maven2-plugins/ws/maven2-plugins/myfaces-javascript-plugin/target/myfaces-javascript-plugin-1.0.3-SNAPSHOT.jar>
[INFO] [plugin:addPluginArtifactMetadata {execution: default-addPluginArtifactMetadata}]
[INFO] [install:install {execution: default-install}]
[INFO] Installing <https://builds.apache.org/job/myfaces-maven2-plugins/ws/maven2-plugins/myfaces-javascript-plugin/target/myfaces-javascript-plugin-1.0.3-SNAPSHOT.jar>
to /home/jenkins/.m2/repository/org/apache/myfaces/buildtools/myfaces-javascript-plugin/1.0.3-SNAPSHOT/myfaces-javascript-plugin-1.0.3-SNAPSHOT.jar
[JENKINS] Archiving <https://builds.apache.org/job/myfaces-maven2-plugins/ws/maven2-plugins/myfaces-javascript-plugin/pom.xml>
to /home/hudson/hudson/jobs/myfaces-maven2-plugins/modules/org.apache.myfaces.buildtools$myfaces-javascript-plugin/builds/2011-10-05_17-01-45/archive/org.apache.myfaces.buildtools/myfaces-javascript-plugin/1.0.3-SNAPSHOT/myfaces-javascript-plugin-1.0.3-SNAPSHOT.pom
[JENKINS] Archiving <https://builds.apache.org/job/myfaces-maven2-plugins/ws/maven2-plugins/myfaces-javascript-plugin/target/myfaces-javascript-plugin-1.0.3-SNAPSHOT.jar>
to /home/hudson/hudson/jobs/myfaces-maven2-plugins/modules/org.apache.myfaces.buildtools$myfaces-javascript-plugin/builds/2011-10-05_17-01-45/archive/org.apache.myfaces.buildtools/myfaces-javascript-plugin/1.0.3-SNAPSHOT/myfaces-javascript-plugin-1.0.3-SNAPSHOT.jar
[INFO] ------------------------------------------------------------------------
[INFO] Building Apache MyFaces Buildtools Maven2 Javascript Documentation Plugin
[INFO]    task-segment: [install]
[INFO] ------------------------------------------------------------------------
[INFO] [antrun:run {execution: javadoc.resources}]
[INFO] Executing tasks
[INFO] Executed tasks
[INFO] [plugin:descriptor {execution: default-descriptor}]
[INFO] Using 'UTF-8' encoding to read mojo metadata.
[INFO] Applying mojo extractor for language: java
[INFO] Mojo extractor for language: java found 3 mojo descriptors.
[INFO] Applying mojo extractor for language: bsh
[INFO] Mojo extractor for language: bsh found 0 mojo descriptors.
[INFO] [remote-resources:process {execution: default}]
[INFO] [resources:resources {execution: default-resources}]
[INFO] Using 'UTF-8' encoding to copy filtered resources.
[INFO] Copying 0 resource
[INFO] Copying 3 resources
[INFO] [compiler:compile {execution: default-compile}]
[INFO] Nothing to compile - all classes are up to date
[INFO] [resources:testResources {execution: default-testResources}]
[INFO] Using 'UTF-8' encoding to copy filtered resources.
[INFO] skip non existing resourceDirectory <https://builds.apache.org/job/myfaces-maven2-plugins/ws/maven2-plugins/myfaces-jsdoc-plugin/src/test/resources>
[INFO] Copying 3 resources
[INFO] [compiler:testCompile {execution: default-testCompile}]
[INFO] No sources to compile
[INFO] [surefire:test {execution: default-test}]
[INFO] Surefire report directory: <https://builds.apache.org/job/myfaces-maven2-plugins/ws/maven2-plugins/myfaces-jsdoc-plugin/target/surefire-reports>

-------------------------------------------------------
 T E S T S
-------------------------------------------------------
There are no tests to run.

Results :

Tests run: 0, Failures: 0, Errors: 0, Skipped: 0

[JENKINS] Recording test results
[INFO] [jar:jar {execution: default-jar}]
[INFO] Building jar: <https://builds.apache.org/job/myfaces-maven2-plugins/ws/maven2-plugins/myfaces-jsdoc-plugin/target/myfaces-jsdoc-plugin-1.0-beta-2-SNAPSHOT.jar>
[INFO] [plugin:addPluginArtifactMetadata {execution: default-addPluginArtifactMetadata}]
[INFO] Preparing checkstyle:check
[INFO] Setting property: classpath.resource.loader.class => 'org.codehaus.plexus.velocity.ContextClassLoaderResourceLoader'.
[INFO] Setting property: velocimacro.messages.on => 'false'.
[INFO] Setting property: resource.loader => 'classpath'.
[INFO] Setting property: resource.manager.logwhenfound => 'false'.
[INFO] ************************************************************** 
[INFO] Starting Jakarta Velocity v1.4
[INFO] RuntimeInstance initializing.
[INFO] Default Properties File: org/apache/velocity/runtime/defaults/velocity.properties
[INFO] Default ResourceManager initializing. (class org.apache.velocity.runtime.resource.ResourceManagerImpl)
[INFO] Resource Loader Instantiated: org.codehaus.plexus.velocity.ContextClassLoaderResourceLoader
[INFO] ClasspathResourceLoader : initialization starting.
[INFO] ClasspathResourceLoader : initialization complete.
[INFO] ResourceCache : initialized. (class org.apache.velocity.runtime.resource.ResourceCacheImpl)
[INFO] Default ResourceManager initialization complete.
[INFO] Loaded System Directive: org.apache.velocity.runtime.directive.Literal
[INFO] Loaded System Directive: org.apache.velocity.runtime.directive.Macro
[INFO] Loaded System Directive: org.apache.velocity.runtime.directive.Parse
[INFO] Loaded System Directive: org.apache.velocity.runtime.directive.Include
[INFO] Loaded System Directive: org.apache.velocity.runtime.directive.Foreach
[INFO] Created: 20 parsers.
[INFO] Velocimacro : initialization starting.
[INFO] Velocimacro : adding VMs from VM library template : VM_global_library.vm
[ERROR] ResourceManager : unable to find resource 'VM_global_library.vm' in any resource loader.
[INFO] Velocimacro : error using  VM library template VM_global_library.vm : org.apache.velocity.exception.ResourceNotFoundException:
Unable to find resource 'VM_global_library.vm'
[INFO] Velocimacro :  VM library template macro registration complete.
[INFO] Velocimacro : allowInline = true : VMs can be defined inline in templates
[INFO] Velocimacro : allowInlineToOverride = false : VMs defined inline may NOT replace previous
VM definitions
[INFO] Velocimacro : allowInlineLocal = false : VMs defined inline will be  global in scope
if allowed.
[INFO] Velocimacro : initialization complete.
[INFO] Velocity successfully started.
[JENKINS] Archiving <https://builds.apache.org/job/myfaces-maven2-plugins/ws/maven2-plugins/myfaces-jsdoc-plugin/pom.xml>
to /home/hudson/hudson/jobs/myfaces-maven2-plugins/modules/org.apache.myfaces.buildtools$myfaces-jsdoc-plugin/builds/2011-10-05_17-01-45/archive/org.apache.myfaces.buildtools/myfaces-jsdoc-plugin/1.0-beta-2-SNAPSHOT/myfaces-jsdoc-plugin-1.0-beta-2-SNAPSHOT.pom
[JENKINS] Archiving <https://builds.apache.org/job/myfaces-maven2-plugins/ws/maven2-plugins/myfaces-jsdoc-plugin/target/myfaces-jsdoc-plugin-1.0-beta-2-SNAPSHOT.jar>
to /home/hudson/hudson/jobs/myfaces-maven2-plugins/modules/org.apache.myfaces.buildtools$myfaces-jsdoc-plugin/builds/2011-10-05_17-01-45/archive/org.apache.myfaces.buildtools/myfaces-jsdoc-plugin/1.0-beta-2-SNAPSHOT/myfaces-jsdoc-plugin-1.0-beta-2-SNAPSHOT.jar
[INFO] [checkstyle:checkstyle {execution: checkstyle}]
[INFO] ------------------------------------------------------------------------
[ERROR] BUILD ERROR
[INFO] ------------------------------------------------------------------------
[INFO] An error has occurred in Checkstyle report generation.

Embedded error: Failed during checkstyle configuration
Property 'fileExtensions' in module Header does not exist, please check the documentation
[INFO] ------------------------------------------------------------------------
[INFO] For more information, run Maven with the -e switch
[INFO] ------------------------------------------------------------------------
[INFO] Total time: 1 minute 10 seconds
[INFO] Finished at: Wed Oct 05 17:03:21 UTC 2011
[INFO] Final Memory: 69M/396M
[INFO] ------------------------------------------------------------------------
Sending e-mails to: grantsmith@apache.org commits@myfaces.apache.org
channel stopped


Mime
View raw message