myfaces-commits mailing list archives

Site index · List index
Message view « Date » · « Thread »
Top « Date » · « Thread »
From Apache Jenkins Server <jenk...@builds.apache.org>
Subject Build failed in Jenkins: myfaces-trinidad-core-1.0 #425
Date Fri, 14 Oct 2011 00:16:18 GMT
See <https://builds.apache.org/job/myfaces-trinidad-core-1.0/425/>

------------------------------------------
[...truncated 6029 lines...]
[INFO] [compiler:testCompile {execution: default-testCompile}]
[INFO] No sources to compile
[INFO] [surefire:test {execution: default-test}]
[INFO] Surefire report directory: <https://builds.apache.org/job/myfaces-trinidad-core-1.0/ws/trinidad-examples/trinidad-blank/target/surefire-reports>

-------------------------------------------------------
 T E S T S
-------------------------------------------------------
There are no tests to run.

Results :

Tests run: 0, Failures: 0, Errors: 0, Skipped: 0

[JENKINS] Recording test results
[INFO] [war:war {execution: default-war}]
[INFO] Packaging webapp
[INFO] Assembling webapp[trinidad-blank] in [<https://builds.apache.org/job/myfaces-trinidad-core-1.0/ws/trinidad-examples/trinidad-blank/target/trinidad-blank-1.0.14-SNAPSHOT]>
[INFO] Dependency[Dependency {groupId=org.apache.myfaces.trinidad, artifactId=trinidad-api,
version=1.0.14-SNAPSHOT, type=jar}] has changed (was Dependency {groupId=org.apache.myfaces.trinidad,
artifactId=trinidad-api, version=1.0.14-SNAPSHOT, type=jar}).
[INFO] Dependency[Dependency {groupId=org.apache.myfaces.trinidad, artifactId=trinidad-impl,
version=1.0.14-SNAPSHOT, type=jar}] has changed (was Dependency {groupId=org.apache.myfaces.trinidad,
artifactId=trinidad-impl, version=1.0.14-SNAPSHOT, type=jar}).
[INFO] Dependency[Dependency {groupId=org.apache.myfaces.core, artifactId=myfaces-api, version=1.1.7,
type=jar}] has changed (was Dependency {groupId=org.apache.myfaces.core, artifactId=myfaces-api,
version=1.1.7, type=jar}).
[INFO] Dependency[Dependency {groupId=org.apache.myfaces.core, artifactId=myfaces-impl, version=1.1.7,
type=jar}] has changed (was Dependency {groupId=org.apache.myfaces.core, artifactId=myfaces-impl,
version=1.1.7, type=jar}).
[INFO] Processing war project
[INFO] Copying webapp resources[<https://builds.apache.org/job/myfaces-trinidad-core-1.0/ws/trinidad-examples/trinidad-blank/src/main/webapp]>
[INFO] Webapp assembled in[39 msecs]
[INFO] Building war: <https://builds.apache.org/job/myfaces-trinidad-core-1.0/ws/trinidad-examples/trinidad-blank/target/trinidad-blank-1.0.14-SNAPSHOT.war>
[INFO] Preparing source:jar
[WARNING] Removing: jar from forked lifecycle, to prevent recursive invocation.
[JENKINS] Re-archiving <https://builds.apache.org/job/myfaces-trinidad-core-1.0/ws/trinidad-examples/trinidad-blank/target/trinidad-blank-1.0.14-SNAPSHOT.war>
[JENKINS] Archiving <https://builds.apache.org/job/myfaces-trinidad-core-1.0/ws/trinidad-examples/trinidad-blank/target/trinidad-blank-1.0.14-SNAPSHOT-sources.jar>
to /home/hudson/hudson/jobs/myfaces-trinidad-core-1.0/modules/org.apache.myfaces.trinidad$trinidad-blank/builds/2011-10-14_00-05-44/archive/org.apache.myfaces.trinidad/trinidad-blank/1.0.14-SNAPSHOT/trinidad-blank-1.0.14-SNAPSHOT-sources.jar
[INFO] [xrts:generate-sources {execution: default}]
[INFO] [source:jar {execution: attach-source}]
[INFO] META-INF already added, skipping
[INFO] META-INF/NOTICE already added, skipping
[INFO] META-INF/LICENSE already added, skipping
[INFO] META-INF already added, skipping
[INFO] META-INF/NOTICE already added, skipping
[INFO] META-INF/LICENSE already added, skipping
[INFO] META-INF already added, skipping
[INFO] META-INF/NOTICE already added, skipping
[INFO] META-INF/LICENSE already added, skipping
[INFO] [install:install {execution: default-install}]
[INFO] Installing <https://builds.apache.org/job/myfaces-trinidad-core-1.0/ws/trinidad-examples/trinidad-blank/target/trinidad-blank-1.0.14-SNAPSHOT.war>
to /home/jenkins/.m2/repository/org/apache/myfaces/trinidad/trinidad-blank/1.0.14-SNAPSHOT/trinidad-blank-1.0.14-SNAPSHOT.war
[INFO] Installing <https://builds.apache.org/job/myfaces-trinidad-core-1.0/ws/trinidad-examples/trinidad-blank/target/trinidad-blank-1.0.14-SNAPSHOT-sources.jar>
to /home/jenkins/.m2/repository/org/apache/myfaces/trinidad/trinidad-blank/1.0.14-SNAPSHOT/trinidad-blank-1.0.14-SNAPSHOT-sources.jar
[INFO] Installing <https://builds.apache.org/job/myfaces-trinidad-core-1.0/ws/trinidad-examples/trinidad-blank/target/trinidad-blank-1.0.14-SNAPSHOT-sources.jar>
to /home/jenkins/.m2/repository/org/apache/myfaces/trinidad/trinidad-blank/1.0.14-SNAPSHOT/trinidad-blank-1.0.14-SNAPSHOT-sources.jar
[INFO] [deploy:deploy {execution: default-deploy}]
[INFO] Retrieving previous build number from apache.snapshots.https
Uploading: https://repository.apache.org/content/repositories/snapshots/org/apache/myfaces/trinidad/trinidad-blank/1.0.14-SNAPSHOT/trinidad-blank-1.0.14-20111014.000625-677.war
6657K uploaded  (trinidad-blank-1.0.14-20111014.000625-677.war)
[INFO] Retrieving previous metadata from apache.snapshots.https
[INFO] Uploading repository metadata for: 'artifact org.apache.myfaces.trinidad:trinidad-blank'
[INFO] Uploading project information for trinidad-blank 1.0.14-20111014.000625-677
[INFO] Retrieving previous metadata from apache.snapshots.https
[INFO] Uploading repository metadata for: 'snapshot org.apache.myfaces.trinidad:trinidad-blank:1.0.14-SNAPSHOT'
[INFO] Retrieving previous build number from apache.snapshots.https
Uploading: https://repository.apache.org/content/repositories/snapshots/org/apache/myfaces/trinidad/trinidad-blank/1.0.14-SNAPSHOT/trinidad-blank-1.0.14-20111014.000625-677-sources.jar
6K uploaded  (trinidad-blank-1.0.14-20111014.000625-677-sources.jar)
[INFO] Retrieving previous build number from apache.snapshots.https
Uploading: https://repository.apache.org/content/repositories/snapshots/org/apache/myfaces/trinidad/trinidad-blank/1.0.14-SNAPSHOT/trinidad-blank-1.0.14-20111014.000625-677-sources.jar
6K uploaded  (trinidad-blank-1.0.14-20111014.000625-677-sources.jar)
[JENKINS] Archiving <https://builds.apache.org/job/myfaces-trinidad-core-1.0/ws/trinidad-examples/trinidad-blank/target/trinidad-blank-1.0.14-SNAPSHOT.war>
to /home/hudson/hudson/jobs/myfaces-trinidad-core-1.0/modules/org.apache.myfaces.trinidad$trinidad-blank/builds/2011-10-14_00-05-44/archive/org.apache.myfaces.trinidad/trinidad-blank/1.0.14-20111014.000625-677/trinidad-blank-1.0.14-20111014.000625-677.war
[JENKINS] Archiving <https://builds.apache.org/job/myfaces-trinidad-core-1.0/ws/trinidad-examples/trinidad-blank/target/trinidad-blank-1.0.14-SNAPSHOT-sources.jar>
to /home/hudson/hudson/jobs/myfaces-trinidad-core-1.0/modules/org.apache.myfaces.trinidad$trinidad-blank/builds/2011-10-14_00-05-44/archive/org.apache.myfaces.trinidad/trinidad-blank/1.0.14-20111014.000625-677/trinidad-blank-1.0.14-20111014.000625-677-sources.jar
[INFO] ------------------------------------------------------------------------
[INFO] Building Apache MyFaces Trinidad Demo
[INFO]    task-segment: [clean, install, deploy]
[INFO] ------------------------------------------------------------------------
[INFO] [clean:clean {execution: default-clean}]
[INFO] Deleting file set: <https://builds.apache.org/job/myfaces-trinidad-core-1.0/ws/trinidad-examples/trinidad-demo/target>
(included: [**], excluded: [])
[INFO] [xrts:generate-sources {execution: default}]
[INFO] [remote-resources:process {execution: default}]
[INFO] [resources:resources {execution: default-resources}]
[INFO] Using 'UTF-8' encoding to copy filtered resources.
[INFO] Copying 0 resource
[INFO] Copying 2 resources
[INFO] [compiler:compile {execution: default-compile}]
[INFO] Compiling 85 source files to <https://builds.apache.org/job/myfaces-trinidad-core-1.0/ws/trinidad-examples/trinidad-demo/target/classes>
[INFO] [xrts:generate-test-sources {execution: default}]
[INFO] [resources:testResources {execution: default-testResources}]
[INFO] Using 'UTF-8' encoding to copy filtered resources.
[INFO] skip non existing resourceDirectory <https://builds.apache.org/job/myfaces-trinidad-core-1.0/ws/trinidad-examples/trinidad-demo/src/test/resources>
[INFO] Copying 2 resources
[INFO] [compiler:testCompile {execution: default-testCompile}]
[INFO] Compiling 5 source files to <https://builds.apache.org/job/myfaces-trinidad-core-1.0/ws/trinidad-examples/trinidad-demo/target/test-classes>
[INFO] [surefire:test {execution: default-test}]
[INFO] Surefire report directory: <https://builds.apache.org/job/myfaces-trinidad-core-1.0/ws/trinidad-examples/trinidad-demo/target/surefire-reports>

-------------------------------------------------------
 T E S T S
-------------------------------------------------------
There are no tests to run.

Results :

Tests run: 0, Failures: 0, Errors: 0, Skipped: 0

[JENKINS] Recording test results
[INFO] [war:war {execution: default-war}]
[INFO] Packaging webapp
[INFO] Assembling webapp[trinidad-demo] in [<https://builds.apache.org/job/myfaces-trinidad-core-1.0/ws/trinidad-examples/trinidad-demo/target/trinidad-demo-1.0.14-SNAPSHOT]>
[INFO] Processing war project
[INFO] Copying webapp resources[<https://builds.apache.org/job/myfaces-trinidad-core-1.0/ws/trinidad-examples/trinidad-demo/src/main/webapp]>
[INFO] Webapp assembled in[790 msecs]
[INFO] Building war: <https://builds.apache.org/job/myfaces-trinidad-core-1.0/ws/trinidad-examples/trinidad-demo/target/trinidad-demo-1.0.14-SNAPSHOT.war>
[INFO] Preparing source:jar
[WARNING] Removing: jar from forked lifecycle, to prevent recursive invocation.
[JENKINS] Archiving <https://builds.apache.org/job/myfaces-trinidad-core-1.0/ws/trinidad-examples/trinidad-demo/pom.xml>
to /home/hudson/hudson/jobs/myfaces-trinidad-core-1.0/modules/org.apache.myfaces.trinidad$trinidad-demo/builds/2011-10-14_00-05-44/archive/org.apache.myfaces.trinidad/trinidad-demo/1.0.14-SNAPSHOT/trinidad-demo-1.0.14-SNAPSHOT.pom
[JENKINS] Archiving <https://builds.apache.org/job/myfaces-trinidad-core-1.0/ws/trinidad-examples/trinidad-demo/target/trinidad-demo-1.0.14-SNAPSHOT.war>
to /home/hudson/hudson/jobs/myfaces-trinidad-core-1.0/modules/org.apache.myfaces.trinidad$trinidad-demo/builds/2011-10-14_00-05-44/archive/org.apache.myfaces.trinidad/trinidad-demo/1.0.14-SNAPSHOT/trinidad-demo-1.0.14-SNAPSHOT.war
[INFO] [xrts:generate-sources {execution: default}]
[INFO] [source:jar {execution: attach-source}]
[INFO] META-INF already added, skipping
[INFO] META-INF already added, skipping
[INFO] META-INF/NOTICE already added, skipping
[INFO] META-INF/LICENSE already added, skipping
[INFO] Building jar: <https://builds.apache.org/job/myfaces-trinidad-core-1.0/ws/trinidad-examples/trinidad-demo/target/trinidad-demo-1.0.14-SNAPSHOT-sources.jar>
[INFO] META-INF already added, skipping
[INFO] META-INF already added, skipping
[INFO] META-INF/NOTICE already added, skipping
[INFO] META-INF/LICENSE already added, skipping
[INFO] [install:install {execution: default-install}]
[INFO] Installing <https://builds.apache.org/job/myfaces-trinidad-core-1.0/ws/trinidad-examples/trinidad-demo/target/trinidad-demo-1.0.14-SNAPSHOT.war>
to /home/jenkins/.m2/repository/org/apache/myfaces/trinidad/trinidad-demo/1.0.14-SNAPSHOT/trinidad-demo-1.0.14-SNAPSHOT.war
[INFO] Installing <https://builds.apache.org/job/myfaces-trinidad-core-1.0/ws/trinidad-examples/trinidad-demo/target/trinidad-demo-1.0.14-SNAPSHOT-sources.jar>
to /home/jenkins/.m2/repository/org/apache/myfaces/trinidad/trinidad-demo/1.0.14-SNAPSHOT/trinidad-demo-1.0.14-SNAPSHOT-sources.jar
[INFO] [xrts:generate-sources {execution: default}]
[INFO] [remote-resources:process {execution: default}]
[INFO] [resources:resources {execution: default-resources}]
[INFO] Using 'UTF-8' encoding to copy filtered resources.
[INFO] Copying 0 resource
[INFO] Copying 2 resources
[INFO] Copying 2 resources
[INFO] [compiler:compile {execution: default-compile}]
[INFO] Nothing to compile - all classes are up to date
[INFO] [xrts:generate-test-sources {execution: default}]
[INFO] [resources:testResources {execution: default-testResources}]
[INFO] Using 'UTF-8' encoding to copy filtered resources.
[INFO] skip non existing resourceDirectory <https://builds.apache.org/job/myfaces-trinidad-core-1.0/ws/trinidad-examples/trinidad-demo/src/test/resources>
[INFO] Copying 2 resources
[INFO] Copying 2 resources
[INFO] [compiler:testCompile {execution: default-testCompile}]
[INFO] Nothing to compile - all classes are up to date
[INFO] [surefire:test {execution: default-test}]
[INFO] Surefire report directory: <https://builds.apache.org/job/myfaces-trinidad-core-1.0/ws/trinidad-examples/trinidad-demo/target/surefire-reports>

-------------------------------------------------------
 T E S T S
-------------------------------------------------------
There are no tests to run.

Results :

Tests run: 0, Failures: 0, Errors: 0, Skipped: 0

[JENKINS] Recording test results
[INFO] [war:war {execution: default-war}]
[INFO] Packaging webapp
[INFO] Assembling webapp[trinidad-demo] in [<https://builds.apache.org/job/myfaces-trinidad-core-1.0/ws/trinidad-examples/trinidad-demo/target/trinidad-demo-1.0.14-SNAPSHOT]>
[INFO] Dependency[Dependency {groupId=javax.mail, artifactId=mail, version=1.4, type=jar}]
has changed (was Dependency {groupId=javax.mail, artifactId=mail, version=1.4, type=jar}).
[INFO] Dependency[Dependency {groupId=javax.activation, artifactId=activation, version=1.1,
type=jar}] has changed (was Dependency {groupId=javax.activation, artifactId=activation, version=1.1,
type=jar}).
[INFO] Dependency[Dependency {groupId=commons-lang, artifactId=commons-lang, version=2.4,
type=jar}] has changed (was Dependency {groupId=commons-lang, artifactId=commons-lang, version=2.4,
type=jar}).
[INFO] Dependency[Dependency {groupId=org.apache.myfaces.trinidad, artifactId=trinidad-api,
version=1.0.14-SNAPSHOT, type=jar}] has changed (was Dependency {groupId=org.apache.myfaces.trinidad,
artifactId=trinidad-api, version=1.0.14-SNAPSHOT, type=jar}).
[INFO] Dependency[Dependency {groupId=org.apache.myfaces.trinidad, artifactId=trinidad-impl,
version=1.0.14-SNAPSHOT, type=jar}] has changed (was Dependency {groupId=org.apache.myfaces.trinidad,
artifactId=trinidad-impl, version=1.0.14-SNAPSHOT, type=jar}).
[INFO] Dependency[Dependency {groupId=org.apache.myfaces.core, artifactId=myfaces-api, version=1.1.7,
type=jar}] has changed (was Dependency {groupId=org.apache.myfaces.core, artifactId=myfaces-api,
version=1.1.7, type=jar}).
[INFO] Dependency[Dependency {groupId=org.apache.myfaces.core, artifactId=myfaces-impl, version=1.1.7,
type=jar}] has changed (was Dependency {groupId=org.apache.myfaces.core, artifactId=myfaces-impl,
version=1.1.7, type=jar}).
[INFO] Processing war project
[INFO] Copying webapp resources[<https://builds.apache.org/job/myfaces-trinidad-core-1.0/ws/trinidad-examples/trinidad-demo/src/main/webapp]>
[INFO] Webapp assembled in[153 msecs]
[INFO] Building war: <https://builds.apache.org/job/myfaces-trinidad-core-1.0/ws/trinidad-examples/trinidad-demo/target/trinidad-demo-1.0.14-SNAPSHOT.war>
[INFO] Preparing source:jar
[WARNING] Removing: jar from forked lifecycle, to prevent recursive invocation.
[JENKINS] Re-archiving <https://builds.apache.org/job/myfaces-trinidad-core-1.0/ws/trinidad-examples/trinidad-demo/target/trinidad-demo-1.0.14-SNAPSHOT.war>
[JENKINS] Archiving <https://builds.apache.org/job/myfaces-trinidad-core-1.0/ws/trinidad-examples/trinidad-demo/target/trinidad-demo-1.0.14-SNAPSHOT-sources.jar>
to /home/hudson/hudson/jobs/myfaces-trinidad-core-1.0/modules/org.apache.myfaces.trinidad$trinidad-demo/builds/2011-10-14_00-05-44/archive/org.apache.myfaces.trinidad/trinidad-demo/1.0.14-SNAPSHOT/trinidad-demo-1.0.14-SNAPSHOT-sources.jar
[INFO] [xrts:generate-sources {execution: default}]
[INFO] [source:jar {execution: attach-source}]
[INFO] META-INF already added, skipping
[INFO] META-INF/NOTICE already added, skipping
[INFO] META-INF/LICENSE already added, skipping
[INFO] META-INF already added, skipping
[INFO] META-INF already added, skipping
[INFO] META-INF/NOTICE already added, skipping
[INFO] META-INF/LICENSE already added, skipping
[INFO] META-INF already added, skipping
[INFO] META-INF/NOTICE already added, skipping
[INFO] META-INF/LICENSE already added, skipping
[INFO] [install:install {execution: default-install}]
[INFO] Installing <https://builds.apache.org/job/myfaces-trinidad-core-1.0/ws/trinidad-examples/trinidad-demo/target/trinidad-demo-1.0.14-SNAPSHOT.war>
to /home/jenkins/.m2/repository/org/apache/myfaces/trinidad/trinidad-demo/1.0.14-SNAPSHOT/trinidad-demo-1.0.14-SNAPSHOT.war
[INFO] Installing <https://builds.apache.org/job/myfaces-trinidad-core-1.0/ws/trinidad-examples/trinidad-demo/target/trinidad-demo-1.0.14-SNAPSHOT-sources.jar>
to /home/jenkins/.m2/repository/org/apache/myfaces/trinidad/trinidad-demo/1.0.14-SNAPSHOT/trinidad-demo-1.0.14-SNAPSHOT-sources.jar
[INFO] Installing <https://builds.apache.org/job/myfaces-trinidad-core-1.0/ws/trinidad-examples/trinidad-demo/target/trinidad-demo-1.0.14-SNAPSHOT-sources.jar>
to /home/jenkins/.m2/repository/org/apache/myfaces/trinidad/trinidad-demo/1.0.14-SNAPSHOT/trinidad-demo-1.0.14-SNAPSHOT-sources.jar
[INFO] [deploy:deploy {execution: default-deploy}]
[INFO] Retrieving previous build number from apache.snapshots.https
Uploading: https://repository.apache.org/content/repositories/snapshots/org/apache/myfaces/trinidad/trinidad-demo/1.0.14-SNAPSHOT/trinidad-demo-1.0.14-20111014.000625-671.war
7934K uploaded  (trinidad-demo-1.0.14-20111014.000625-671.war)
[INFO] Retrieving previous metadata from apache.snapshots.https
[INFO] Uploading repository metadata for: 'snapshot org.apache.myfaces.trinidad:trinidad-demo:1.0.14-SNAPSHOT'
[INFO] Uploading project information for trinidad-demo 1.0.14-20111014.000625-671
[INFO] Retrieving previous metadata from apache.snapshots.https
[INFO] Uploading repository metadata for: 'artifact org.apache.myfaces.trinidad:trinidad-demo'
[INFO] Retrieving previous build number from apache.snapshots.https
Uploading: https://repository.apache.org/content/repositories/snapshots/org/apache/myfaces/trinidad/trinidad-demo/1.0.14-SNAPSHOT/trinidad-demo-1.0.14-20111014.000625-671-sources.jar
132K uploaded  (trinidad-demo-1.0.14-20111014.000625-671-sources.jar)
[INFO] Retrieving previous build number from apache.snapshots.https
Uploading: https://repository.apache.org/content/repositories/snapshots/org/apache/myfaces/trinidad/trinidad-demo/1.0.14-SNAPSHOT/trinidad-demo-1.0.14-20111014.000625-671-sources.jar
132K uploaded  (trinidad-demo-1.0.14-20111014.000625-671-sources.jar)
[JENKINS] Archiving <https://builds.apache.org/job/myfaces-trinidad-core-1.0/ws/trinidad-examples/trinidad-demo/target/trinidad-demo-1.0.14-SNAPSHOT.war>
to /home/hudson/hudson/jobs/myfaces-trinidad-core-1.0/modules/org.apache.myfaces.trinidad$trinidad-demo/builds/2011-10-14_00-05-44/archive/org.apache.myfaces.trinidad/trinidad-demo/1.0.14-20111014.000625-671/trinidad-demo-1.0.14-20111014.000625-671.war
[JENKINS] Archiving <https://builds.apache.org/job/myfaces-trinidad-core-1.0/ws/trinidad-examples/trinidad-demo/target/trinidad-demo-1.0.14-SNAPSHOT-sources.jar>
to /home/hudson/hudson/jobs/myfaces-trinidad-core-1.0/modules/org.apache.myfaces.trinidad$trinidad-demo/builds/2011-10-14_00-05-44/archive/org.apache.myfaces.trinidad/trinidad-demo/1.0.14-20111014.000625-671/trinidad-demo-1.0.14-20111014.000625-671-sources.jar
[INFO] 
[INFO] 
[INFO] ------------------------------------------------------------------------
[INFO] Reactor Summary:
[INFO] ------------------------------------------------------------------------
[INFO] Apache MyFaces Trinidad ............................... SUCCESS [16.353s]
[INFO] Apache MyFaces Trinidad Build ......................... SUCCESS [23.064s]
[INFO] Apache MyFaces Trinidad API ........................... SUCCESS [1:12.613s]
[INFO] Apache MyFaces Trinidad Impl .......................... SUCCESS [2:43.362s]
[INFO] Apache MyFaces Trinidad Examples ...................... SUCCESS [4.374s]
[INFO] Apache MyFaces Trinidad Blank Demo .................... SUCCESS [1:24.810s]
[INFO] Apache MyFaces Trinidad Demo .......................... SUCCESS [1:36.661s]
[INFO] ------------------------------------------------------------------------
[INFO] ------------------------------------------------------------------------
[INFO] BUILD SUCCESSFUL
[INFO] ------------------------------------------------------------------------
[INFO] Total time: 10 minutes 4 seconds
[INFO] Finished at: Fri Oct 14 00:16:16 UTC 2011
[INFO] Final Memory: 73M/405M
[INFO] ------------------------------------------------------------------------
channel stopped
Maven RedeployPublished use remote ubuntu5 maven settings from : /home/jenkins/.m2/settings.xml
[INFO] Deployment in https://repository.apache.org/content/repositories/snapshots (id=,uniqueVersion=false)
Deploying the main artifact trinidad-1.0.14-20111014.000625-709.pom
ERROR: Error deploying artifact: Failed to transfer file: https://repository.apache.org/content/repositories/snapshots/org/apache/myfaces/trinidad/trinidad/1.0.14-SNAPSHOT/trinidad-1.0.14-SNAPSHOT.pom.
Return code is: 401
org.apache.maven.artifact.deployer.ArtifactDeploymentException: Error deploying artifact:
Failed to transfer file: https://repository.apache.org/content/repositories/snapshots/org/apache/myfaces/trinidad/trinidad/1.0.14-SNAPSHOT/trinidad-1.0.14-SNAPSHOT.pom.
Return code is: 401
	at hudson.maven.artifact.deployer.DefaultArtifactDeployer.deploy(DefaultArtifactDeployer.java:175)
	at hudson.maven.reporters.MavenArtifactRecord.deploy(MavenArtifactRecord.java:189)
	at hudson.maven.RedeployPublisher.perform(RedeployPublisher.java:158)
	at hudson.tasks.BuildStepMonitor$1.perform(BuildStepMonitor.java:19)
	at hudson.model.AbstractBuild$AbstractRunner.perform(AbstractBuild.java:693)
	at hudson.model.AbstractBuild$AbstractRunner.performAllBuildSteps(AbstractBuild.java:668)
	at hudson.maven.MavenModuleSetBuild$RunnerImpl.post2(MavenModuleSetBuild.java:953)
	at hudson.model.AbstractBuild$AbstractRunner.post(AbstractBuild.java:615)
	at hudson.model.Run.run(Run.java:1401)
	at hudson.maven.MavenModuleSetBuild.run(MavenModuleSetBuild.java:474)
	at hudson.model.ResourceController.execute(ResourceController.java:88)
	at hudson.model.Executor.run(Executor.java:230)
Caused by: org.apache.maven.wagon.TransferFailedException: Failed to transfer file: https://repository.apache.org/content/repositories/snapshots/org/apache/myfaces/trinidad/trinidad/1.0.14-SNAPSHOT/trinidad-1.0.14-SNAPSHOT.pom.
Return code is: 401
	at org.apache.maven.wagon.shared.http.AbstractHttpClientWagon.put(AbstractHttpClientWagon.java:368)
	at org.apache.maven.wagon.shared.http.AbstractHttpClientWagon.put(AbstractHttpClientWagon.java:280)
	at org.apache.maven.repository.legacy.DefaultWagonManager.putRemoteFile(DefaultWagonManager.java:543)
	at org.apache.maven.repository.legacy.DefaultWagonManager.putArtifact(DefaultWagonManager.java:494)
	at hudson.maven.artifact.deployer.DefaultArtifactDeployer.deploy(DefaultArtifactDeployer.java:160)
	... 11 more
[INFO] Deployment failed after 0.71 sec
Build step 'Deploy artifacts to Maven repository' changed build result to FAILURE


Mime
View raw message