myfaces-commits mailing list archives

Site index · List index
Message view « Date » · « Thread »
Top « Date » · « Thread »
From Apache Jenkins Server <jenk...@builds.apache.org>
Subject Build failed in Jenkins: myfaces-trinidad-plugins-20x #328
Date Sat, 01 Oct 2011 00:07:33 GMT
See <https://builds.apache.org/job/myfaces-trinidad-plugins-20x/328/>

------------------------------------------
[...truncated 734 lines...]
[INFO] Copying 0 resource
[INFO] Copying 2 resources
[INFO] [compiler:compile {execution: default-compile}]
[INFO] Compiling 5 source files to <https://builds.apache.org/job/myfaces-trinidad-plugins-20x/ws/maven-i18n-plugin/target/classes>
[INFO] [resources:testResources {execution: default-testResources}]
[INFO] Using 'UTF-8' encoding to copy filtered resources.
[INFO] skip non existing resourceDirectory <https://builds.apache.org/job/myfaces-trinidad-plugins-20x/ws/maven-i18n-plugin/src/test/resources>
[INFO] Copying 2 resources
[INFO] [compiler:testCompile {execution: default-testCompile}]
[INFO] No sources to compile
[INFO] [surefire:test {execution: default-test}]
[INFO] Surefire report directory: <https://builds.apache.org/job/myfaces-trinidad-plugins-20x/ws/maven-i18n-plugin/target/surefire-reports>

-------------------------------------------------------
 T E S T S
-------------------------------------------------------
There are no tests to run.

Results :

Tests run: 0, Failures: 0, Errors: 0, Skipped: 0

[JENKINS] Recording test results
[INFO] [jar:jar {execution: default-jar}]
[INFO] Building jar: <https://builds.apache.org/job/myfaces-trinidad-plugins-20x/ws/maven-i18n-plugin/target/maven-i18n-plugin-2.0.7-SNAPSHOT.jar>
[INFO] [plugin:addPluginArtifactMetadata {execution: default-addPluginArtifactMetadata}]
[INFO] [install:install {execution: default-install}]
[INFO] Installing <https://builds.apache.org/job/myfaces-trinidad-plugins-20x/ws/maven-i18n-plugin/target/maven-i18n-plugin-2.0.7-SNAPSHOT.jar>
to /home/hudson/.m2/repository/org/apache/myfaces/trinidadbuild/maven-i18n-plugin/2.0.7-SNAPSHOT/maven-i18n-plugin-2.0.7-SNAPSHOT.jar
[JENKINS] Archiving <https://builds.apache.org/job/myfaces-trinidad-plugins-20x/ws/maven-i18n-plugin/pom.xml>
to /home/hudson/hudson/jobs/myfaces-trinidad-plugins-20x/modules/org.apache.myfaces.trinidadbuild$maven-i18n-plugin/builds/2011-10-01_00-06-09/archive/org.apache.myfaces.trinidadbuild/maven-i18n-plugin/2.0.7-SNAPSHOT/maven-i18n-plugin-2.0.7-SNAPSHOT.pom
[JENKINS] Archiving <https://builds.apache.org/job/myfaces-trinidad-plugins-20x/ws/maven-i18n-plugin/target/maven-i18n-plugin-2.0.7-SNAPSHOT.jar>
to /home/hudson/hudson/jobs/myfaces-trinidad-plugins-20x/modules/org.apache.myfaces.trinidadbuild$maven-i18n-plugin/builds/2011-10-01_00-06-09/archive/org.apache.myfaces.trinidadbuild/maven-i18n-plugin/2.0.7-SNAPSHOT/maven-i18n-plugin-2.0.7-SNAPSHOT.jar
[INFO] ------------------------------------------------------------------------
[INFO] Building Apache Trinidad Maven Javascript Plugin
[INFO]    task-segment: [install]
[INFO] ------------------------------------------------------------------------
[INFO] [enforcer:enforce {execution: enforce-versions}]
[WARNING] While downloading javacc:javacc:3.2
  This artifact has been relocated to net.java.dev.javacc:javacc:3.2.


[INFO] [javacc:generate {execution: default}]
Java Compiler Compiler Version 3.2 (Parser Generator)
(type "javacc" with no arguments for help)
Reading from file <https://builds.apache.org/job/myfaces-trinidad-plugins-20x/ws/maven-javascript-plugin/src/main/java/org/apache/myfaces/trinidadbuild/plugin/javascript/obfuscator/javascript15parser/js1.5.jj>
. . .
File "TokenMgrError.java" does not exist.  Will create one.
File "ParseException.java" does not exist.  Will create one.
File "Token.java" does not exist.  Will create one.
File "SimpleCharStream.java" does not exist.  Will create one.
Parser generated successfully.
[INFO] [plugin:descriptor {execution: default-descriptor}]
[INFO] Using 'UTF-8' encoding to read mojo metadata.
[INFO] Applying mojo extractor for language: java
[INFO] Mojo extractor for language: java found 2 mojo descriptors.
[INFO] Applying mojo extractor for language: bsh
[INFO] Mojo extractor for language: bsh found 0 mojo descriptors.
[INFO] [remote-resources:process {execution: default}]
[INFO] [resources:resources {execution: default-resources}]
[INFO] Using 'UTF-8' encoding to copy filtered resources.
[INFO] Copying 0 resource
[INFO] Copying 2 resources
[INFO] [compiler:compile {execution: default-compile}]
[INFO] Compiling 197 source files to <https://builds.apache.org/job/myfaces-trinidad-plugins-20x/ws/maven-javascript-plugin/target/classes>
[INFO] [resources:testResources {execution: default-testResources}]
[INFO] Using 'UTF-8' encoding to copy filtered resources.
[INFO] skip non existing resourceDirectory <https://builds.apache.org/job/myfaces-trinidad-plugins-20x/ws/maven-javascript-plugin/src/test/resources>
[INFO] Copying 2 resources
[INFO] [compiler:testCompile {execution: default-testCompile}]
[INFO] No sources to compile
[INFO] [surefire:test {execution: default-test}]
[INFO] Surefire report directory: <https://builds.apache.org/job/myfaces-trinidad-plugins-20x/ws/maven-javascript-plugin/target/surefire-reports>

-------------------------------------------------------
 T E S T S
-------------------------------------------------------
There are no tests to run.

Results :

Tests run: 0, Failures: 0, Errors: 0, Skipped: 0

[JENKINS] Recording test results
[INFO] [jar:jar {execution: default-jar}]
[INFO] Building jar: <https://builds.apache.org/job/myfaces-trinidad-plugins-20x/ws/maven-javascript-plugin/target/maven-javascript-plugin-2.0.7-SNAPSHOT.jar>
[INFO] [plugin:addPluginArtifactMetadata {execution: default-addPluginArtifactMetadata}]
[INFO] [install:install {execution: default-install}]
[INFO] Installing <https://builds.apache.org/job/myfaces-trinidad-plugins-20x/ws/maven-javascript-plugin/target/maven-javascript-plugin-2.0.7-SNAPSHOT.jar>
to /home/hudson/.m2/repository/org/apache/myfaces/trinidadbuild/maven-javascript-plugin/2.0.7-SNAPSHOT/maven-javascript-plugin-2.0.7-SNAPSHOT.jar
[JENKINS] Archiving <https://builds.apache.org/job/myfaces-trinidad-plugins-20x/ws/maven-javascript-plugin/pom.xml>
to /home/hudson/hudson/jobs/myfaces-trinidad-plugins-20x/modules/org.apache.myfaces.trinidadbuild$maven-javascript-plugin/builds/2011-10-01_00-06-09/archive/org.apache.myfaces.trinidadbuild/maven-javascript-plugin/2.0.7-SNAPSHOT/maven-javascript-plugin-2.0.7-SNAPSHOT.pom
[JENKINS] Archiving <https://builds.apache.org/job/myfaces-trinidad-plugins-20x/ws/maven-javascript-plugin/target/maven-javascript-plugin-2.0.7-SNAPSHOT.jar>
to /home/hudson/hudson/jobs/myfaces-trinidad-plugins-20x/modules/org.apache.myfaces.trinidadbuild$maven-javascript-plugin/builds/2011-10-01_00-06-09/archive/org.apache.myfaces.trinidadbuild/maven-javascript-plugin/2.0.7-SNAPSHOT/maven-javascript-plugin-2.0.7-SNAPSHOT.jar
[INFO] ------------------------------------------------------------------------
[INFO] Building Apache Trinidad Maven XRTS Plugin
[INFO]    task-segment: [install]
[INFO] ------------------------------------------------------------------------
[INFO] [enforcer:enforce {execution: enforce-versions}]
[INFO] [plugin:descriptor {execution: default-descriptor}]
[INFO] Using 2 extractors.
[INFO] Applying extractor for language: java
[INFO] Extractor for language: java found 2 mojo descriptors.
[INFO] Applying extractor for language: bsh
[INFO] Extractor for language: bsh found 0 mojo descriptors.
[INFO] [remote-resources:process {execution: default}]
[INFO] [resources:resources {execution: default-resources}]
[INFO] Using 'UTF-8' encoding to copy filtered resources.
[INFO] Copying 0 resource
[INFO] Copying 2 resources
[INFO] [compiler:compile {execution: default-compile}]
[INFO] Compiling 8 source files to <https://builds.apache.org/job/myfaces-trinidad-plugins-20x/ws/maven-xrts-plugin/target/classes>
[WARNING]  no such file or directory
<https://builds.apache.org/job/myfaces-trinidad-plugins-20x/ws/maven-xrts-plugin/src/main/java/org/apache/myfaces/trinidadbuild/plugin/xrts/XRTSGenerator.java>:[26,18]
[deprecation] org.xml.sax.Parser in org.xml.sax has been deprecated

[WARNING] <https://builds.apache.org/job/myfaces-trinidad-plugins-20x/ws/maven-xrts-plugin/src/main/java/org/apache/myfaces/trinidadbuild/plugin/xrts/XRTSParser.java>:[27,18]
[deprecation] org.xml.sax.AttributeList in org.xml.sax has been deprecated

[WARNING] <https://builds.apache.org/job/myfaces-trinidad-plugins-20x/ws/maven-xrts-plugin/src/main/java/org/apache/myfaces/trinidadbuild/plugin/xrts/XRTSParser.java>:[28,18]
[deprecation] org.xml.sax.HandlerBase in org.xml.sax has been deprecated

[WARNING] <https://builds.apache.org/job/myfaces-trinidad-plugins-20x/ws/maven-xrts-plugin/src/main/java/org/apache/myfaces/trinidadbuild/plugin/xrts/XRTSParser.java>:[36,31]
[deprecation] org.xml.sax.HandlerBase in org.xml.sax has been deprecated

[WARNING] <https://builds.apache.org/job/myfaces-trinidad-plugins-20x/ws/maven-xrts-plugin/src/main/java/org/apache/myfaces/trinidadbuild/plugin/xrts/XRTSParser.java>:[100,40]
[deprecation] org.xml.sax.AttributeList in org.xml.sax has been deprecated

[WARNING] <https://builds.apache.org/job/myfaces-trinidad-plugins-20x/ws/maven-xrts-plugin/src/main/java/org/apache/myfaces/trinidadbuild/plugin/xrts/AbstractGenerateSourcesMojo.java>:[100,25]
[unchecked] unchecked call to LinkedList(java.util.Collection<? extends E>) as a member
of the raw type java.util.LinkedList

[WARNING] <https://builds.apache.org/job/myfaces-trinidad-plugins-20x/ws/maven-xrts-plugin/src/main/java/org/apache/myfaces/trinidadbuild/plugin/xrts/AbstractGenerateSourcesMojo.java>:[133,22]
[unchecked] unchecked call to put(K,V) as a member of the raw type java.util.Map

[WARNING] <https://builds.apache.org/job/myfaces-trinidad-plugins-20x/ws/maven-xrts-plugin/src/main/java/org/apache/myfaces/trinidadbuild/plugin/xrts/AbstractGenerateSourcesMojo.java>:[134,22]
[unchecked] unchecked call to put(K,V) as a member of the raw type java.util.Map

[WARNING] <https://builds.apache.org/job/myfaces-trinidad-plugins-20x/ws/maven-xrts-plugin/src/main/java/org/apache/myfaces/trinidadbuild/plugin/xrts/AbstractGenerateSourcesMojo.java>:[135,22]
[unchecked] unchecked call to put(K,V) as a member of the raw type java.util.Map

[WARNING] <https://builds.apache.org/job/myfaces-trinidad-plugins-20x/ws/maven-xrts-plugin/src/main/java/org/apache/myfaces/trinidadbuild/plugin/xrts/AbstractGenerateSourcesMojo.java>:[136,22]
[unchecked] unchecked call to put(K,V) as a member of the raw type java.util.Map

[WARNING] <https://builds.apache.org/job/myfaces-trinidad-plugins-20x/ws/maven-xrts-plugin/src/main/java/org/apache/myfaces/trinidadbuild/plugin/xrts/AbstractGenerateSourcesMojo.java>:[137,22]
[unchecked] unchecked call to put(K,V) as a member of the raw type java.util.Map

[WARNING] <https://builds.apache.org/job/myfaces-trinidad-plugins-20x/ws/maven-xrts-plugin/src/main/java/org/apache/myfaces/trinidadbuild/plugin/xrts/AbstractGenerateSourcesMojo.java>:[140,57]
[deprecation] toURL() in java.io.File has been deprecated

[INFO] [resources:testResources {execution: default-testResources}]
[INFO] Using 'UTF-8' encoding to copy filtered resources.
[INFO] skip non existing resourceDirectory <https://builds.apache.org/job/myfaces-trinidad-plugins-20x/ws/maven-xrts-plugin/src/test/resources>
[INFO] Copying 2 resources
[INFO] [compiler:testCompile {execution: default-testCompile}]
[INFO] No sources to compile
[INFO] [surefire:test {execution: default-test}]
[INFO] Surefire report directory: <https://builds.apache.org/job/myfaces-trinidad-plugins-20x/ws/maven-xrts-plugin/target/surefire-reports>

-------------------------------------------------------
 T E S T S
-------------------------------------------------------
There are no tests to run.

Results :

Tests run: 0, Failures: 0, Errors: 0, Skipped: 0

[JENKINS] Recording test results
[INFO] [jar:jar {execution: default-jar}]
[INFO] Building jar: <https://builds.apache.org/job/myfaces-trinidad-plugins-20x/ws/maven-xrts-plugin/target/maven-xrts-plugin-2.0.7-SNAPSHOT.jar>
[INFO] [plugin:addPluginArtifactMetadata {execution: default-addPluginArtifactMetadata}]
[INFO] [install:install {execution: default-install}]
[INFO] Installing <https://builds.apache.org/job/myfaces-trinidad-plugins-20x/ws/maven-xrts-plugin/target/maven-xrts-plugin-2.0.7-SNAPSHOT.jar>
to /home/hudson/.m2/repository/org/apache/myfaces/trinidadbuild/maven-xrts-plugin/2.0.7-SNAPSHOT/maven-xrts-plugin-2.0.7-SNAPSHOT.jar
[JENKINS] Archiving <https://builds.apache.org/job/myfaces-trinidad-plugins-20x/ws/maven-xrts-plugin/pom.xml>
to /home/hudson/hudson/jobs/myfaces-trinidad-plugins-20x/modules/org.apache.myfaces.trinidadbuild$maven-xrts-plugin/builds/2011-10-01_00-06-09/archive/org.apache.myfaces.trinidadbuild/maven-xrts-plugin/2.0.7-SNAPSHOT/maven-xrts-plugin-2.0.7-SNAPSHOT.pom
[JENKINS] Archiving <https://builds.apache.org/job/myfaces-trinidad-plugins-20x/ws/maven-xrts-plugin/target/maven-xrts-plugin-2.0.7-SNAPSHOT.jar>
to /home/hudson/hudson/jobs/myfaces-trinidad-plugins-20x/modules/org.apache.myfaces.trinidadbuild$maven-xrts-plugin/builds/2011-10-01_00-06-09/archive/org.apache.myfaces.trinidadbuild/maven-xrts-plugin/2.0.7-SNAPSHOT/maven-xrts-plugin-2.0.7-SNAPSHOT.jar
[INFO] ------------------------------------------------------------------------
[INFO] Building Apache Trinidad Maven Tag Documentation Report
[INFO]    task-segment: [install]
[INFO] ------------------------------------------------------------------------
[INFO] snapshot org.apache.myfaces.trinidadbuild:maven-faces-plugin:2.0.7-SNAPSHOT: checking
for updates from apache.snapshots
[INFO] [enforcer:enforce {execution: enforce-versions}]
[INFO] [plugin:descriptor {execution: default-descriptor}]
[INFO] Using 'UTF-8' encoding to read mojo metadata.
[INFO] Applying mojo extractor for language: java
[INFO] Mojo extractor for language: java found 1 mojo descriptors.
[INFO] Applying mojo extractor for language: bsh
[INFO] Mojo extractor for language: bsh found 0 mojo descriptors.
[INFO] [remote-resources:process {execution: default}]
[INFO] [resources:resources {execution: default-resources}]
[INFO] Using 'UTF-8' encoding to copy filtered resources.
[INFO] Copying 0 resource
[INFO] Copying 2 resources
[INFO] [compiler:compile {execution: default-compile}]
[INFO] Compiling 1 source file to <https://builds.apache.org/job/myfaces-trinidad-plugins-20x/ws/maven-tagdoc-plugin/target/classes>
[INFO] [resources:testResources {execution: default-testResources}]
[INFO] Using 'UTF-8' encoding to copy filtered resources.
[INFO] skip non existing resourceDirectory <https://builds.apache.org/job/myfaces-trinidad-plugins-20x/ws/maven-tagdoc-plugin/src/test/resources>
[INFO] Copying 2 resources
[INFO] [compiler:testCompile {execution: default-testCompile}]
[INFO] No sources to compile
[INFO] [surefire:test {execution: default-test}]
[INFO] Surefire report directory: <https://builds.apache.org/job/myfaces-trinidad-plugins-20x/ws/maven-tagdoc-plugin/target/surefire-reports>

-------------------------------------------------------
 T E S T S
-------------------------------------------------------
There are no tests to run.

Results :

Tests run: 0, Failures: 0, Errors: 0, Skipped: 0

[JENKINS] Recording test results
[INFO] [jar:jar {execution: default-jar}]
[INFO] Building jar: <https://builds.apache.org/job/myfaces-trinidad-plugins-20x/ws/maven-tagdoc-plugin/target/maven-tagdoc-plugin-2.0.7-SNAPSHOT.jar>
[INFO] [plugin:addPluginArtifactMetadata {execution: default-addPluginArtifactMetadata}]
[INFO] [install:install {execution: default-install}]
[INFO] Installing <https://builds.apache.org/job/myfaces-trinidad-plugins-20x/ws/maven-tagdoc-plugin/target/maven-tagdoc-plugin-2.0.7-SNAPSHOT.jar>
to /home/hudson/.m2/repository/org/apache/myfaces/trinidadbuild/maven-tagdoc-plugin/2.0.7-SNAPSHOT/maven-tagdoc-plugin-2.0.7-SNAPSHOT.jar
[JENKINS] Archiving <https://builds.apache.org/job/myfaces-trinidad-plugins-20x/ws/maven-tagdoc-plugin/pom.xml>
to /home/hudson/hudson/jobs/myfaces-trinidad-plugins-20x/modules/org.apache.myfaces.trinidadbuild$maven-tagdoc-plugin/builds/2011-10-01_00-06-09/archive/org.apache.myfaces.trinidadbuild/maven-tagdoc-plugin/2.0.7-SNAPSHOT/maven-tagdoc-plugin-2.0.7-SNAPSHOT.pom
[JENKINS] Archiving <https://builds.apache.org/job/myfaces-trinidad-plugins-20x/ws/maven-tagdoc-plugin/target/maven-tagdoc-plugin-2.0.7-SNAPSHOT.jar>
to /home/hudson/hudson/jobs/myfaces-trinidad-plugins-20x/modules/org.apache.myfaces.trinidadbuild$maven-tagdoc-plugin/builds/2011-10-01_00-06-09/archive/org.apache.myfaces.trinidadbuild/maven-tagdoc-plugin/2.0.7-SNAPSHOT/maven-tagdoc-plugin-2.0.7-SNAPSHOT.jar
[INFO] 
[INFO] 
[INFO] ------------------------------------------------------------------------
[INFO] Reactor Summary:
[INFO] ------------------------------------------------------------------------
[INFO] Apache Trinidad Maven Plugin Parent ................... SUCCESS [6.776s]
[INFO] Apache Trinidad Maven JDev Plugin ..................... SUCCESS [4.366s]
[INFO] Apache Trinidad Maven Faces Plugin .................... SUCCESS [21.677s]
[INFO] Apache Trinidad Maven Javacc Plugin ................... SUCCESS [2.242s]
[INFO] Apache Trinidad Maven i18n Plugin ..................... SUCCESS [3.889s]
[INFO] Apache Trinidad Maven Javascript Plugin ............... SUCCESS [4.520s]
[INFO] Apache Trinidad Maven XRTS Plugin ..................... SUCCESS [1.451s]
[INFO] Apache Trinidad Maven Tag Documentation Report ........ SUCCESS [2.573s]
[INFO] ------------------------------------------------------------------------
[INFO] ------------------------------------------------------------------------
[INFO] BUILD SUCCESSFUL
[INFO] ------------------------------------------------------------------------
[INFO] Total time: 59 seconds
[INFO] Finished at: Sat Oct 01 00:07:31 UTC 2011
[INFO] Final Memory: 68M/386M
[INFO] ------------------------------------------------------------------------
channel stopped
Maven RedeployPublished use remote ubuntu2 maven settings from : /home/hudson/.m2/settings.xml
[INFO] Deployment in https://repository.apache.org/content/repositories/snapshots (id=,uniqueVersion=false)
Deploying the main artifact maven-faces-plugin-2.0.7-SNAPSHOT.jar
ERROR: Error deploying artifact: Failed to transfer file: https://repository.apache.org/content/repositories/snapshots/org/apache/myfaces/trinidadbuild/maven-faces-plugin/2.0.7-SNAPSHOT/maven-faces-plugin-2.0.7-SNAPSHOT.jar.
Return code is: 401
org.apache.maven.artifact.deployer.ArtifactDeploymentException: Error deploying artifact:
Failed to transfer file: https://repository.apache.org/content/repositories/snapshots/org/apache/myfaces/trinidadbuild/maven-faces-plugin/2.0.7-SNAPSHOT/maven-faces-plugin-2.0.7-SNAPSHOT.jar.
Return code is: 401
	at hudson.maven.artifact.deployer.DefaultArtifactDeployer.deploy(DefaultArtifactDeployer.java:175)
	at hudson.maven.reporters.MavenArtifactRecord.deploy(MavenArtifactRecord.java:189)
	at hudson.maven.RedeployPublisher.perform(RedeployPublisher.java:158)
	at hudson.tasks.BuildStepMonitor$1.perform(BuildStepMonitor.java:19)
	at hudson.model.AbstractBuild$AbstractRunner.perform(AbstractBuild.java:693)
	at hudson.model.AbstractBuild$AbstractRunner.performAllBuildSteps(AbstractBuild.java:668)
	at hudson.maven.MavenModuleSetBuild$RunnerImpl.post2(MavenModuleSetBuild.java:953)
	at hudson.model.AbstractBuild$AbstractRunner.post(AbstractBuild.java:615)
	at hudson.model.Run.run(Run.java:1401)
	at hudson.maven.MavenModuleSetBuild.run(MavenModuleSetBuild.java:474)
	at hudson.model.ResourceController.execute(ResourceController.java:88)
	at hudson.model.Executor.run(Executor.java:230)
Caused by: org.apache.maven.wagon.TransferFailedException: Failed to transfer file: https://repository.apache.org/content/repositories/snapshots/org/apache/myfaces/trinidadbuild/maven-faces-plugin/2.0.7-SNAPSHOT/maven-faces-plugin-2.0.7-SNAPSHOT.jar.
Return code is: 401
	at org.apache.maven.wagon.shared.http.AbstractHttpClientWagon.put(AbstractHttpClientWagon.java:368)
	at org.apache.maven.wagon.shared.http.AbstractHttpClientWagon.put(AbstractHttpClientWagon.java:280)
	at org.apache.maven.repository.legacy.DefaultWagonManager.putRemoteFile(DefaultWagonManager.java:543)
	at org.apache.maven.repository.legacy.DefaultWagonManager.putArtifact(DefaultWagonManager.java:494)
	at hudson.maven.artifact.deployer.DefaultArtifactDeployer.deploy(DefaultArtifactDeployer.java:160)
	... 11 more
[INFO] Deployment failed after 1 sec
Build step 'Deploy artifacts to Maven repository' changed build result to FAILURE


Mime
View raw message