myfaces-commits mailing list archives

Site index · List index
Message view « Date » · « Thread »
Top « Date » · « Thread »
From Apache Jenkins Server <jenk...@builds.apache.org>
Subject Build failed in Jenkins: myfaces-trinidad-core-2 #325
Date Sat, 25 Jun 2011 02:24:03 GMT
See <https://builds.apache.org/job/myfaces-trinidad-core-2/325/>

------------------------------------------
Started by timer
Building remotely on solaris1
Updating https://svn.apache.org/repos/asf/myfaces/trinidad/trunk
At revision 1139480
no change for https://svn.apache.org/repos/asf/myfaces/trinidad/trunk since the previous build
Unpacking http://archive.apache.org/dist/maven/binaries/apache-maven-3.0.2-bin.zip to /home/hudson/tools/maven/apache-maven-3.0.2
on solaris1
Found mavenVersion 3.0.2 from file jar:file:/home/hudson/tools/maven/apache-maven-3.0.2/lib/maven-core-3.0.2.jar!/META-INF/maven/org.apache.maven/maven-core/pom.properties
Parsing POMs
[myfaces-trinidad-core-2] $ /home/hudson/tools/java/latest1.6/bin/java -cp /export/home/hudson/hudson-slave/maven3-agent.jar:/home/hudson/tools/maven/apache-maven-3.0.2/boot/plexus-classworlds-2.4.jar
org.jvnet.hudson.maven3.agent.Maven3Main /home/hudson/tools/maven/apache-maven-3.0.2 /zonestorage/hudson_solaris/home/hudson/hudson-slave/slave.jar
/export/home/hudson/hudson-slave/maven3-interceptor.jar 62556
channel started
<===[HUDSON REMOTING CAPACITY]===>   Executing Maven:  -B -f <https://builds.apache.org/job/myfaces-trinidad-core-2/ws/pom.xml>
clean install deploy
[INFO] Scanning for projects...
[WARNING] 
[WARNING] Some problems were encountered while building the effective model for org.apache.myfaces.trinidad:trinidad-build:jar:2.0.1-SNAPSHOT
[WARNING] 'reporting.plugins.plugin.version' for org.codehaus.mojo:rat-maven-plugin is missing.
[WARNING] 
[WARNING] Some problems were encountered while building the effective model for org.apache.myfaces.trinidad:trinidad-api:jar:2.0.1-SNAPSHOT
[WARNING] 'reporting.plugins.plugin.version' for org.codehaus.mojo:rat-maven-plugin is missing.
[WARNING] 'reporting.plugins.plugin.version' for org.apache.myfaces.trinidadbuild:maven-tagdoc-plugin
is missing. @ line 304, column 15
[WARNING] 'reporting.plugins.plugin.version' for org.apache.maven.plugins:maven-javadoc-plugin
is missing. @ line 315, column 15
[WARNING] 'reporting.plugins.plugin.version' for org.apache.maven.plugins:maven-jxr-plugin
is missing. @ line 331, column 15
[WARNING] 'reporting.plugins.plugin.version' for org.apache.maven.plugins:maven-changelog-plugin
is missing. @ line 336, column 15
[INFO] [WARNING] 
[WARNING] Some problems were encountered while building the effective model for org.apache.myfaces.trinidad:trinidad-impl:jar:2.0.1-SNAPSHOT
------------------------------------------------------------------------[WARNING] 'reporting.plugins.plugin.version'
for org.codehaus.mojo:rat-maven-plugin is missing.

[WARNING] 
[WARNING] Some problems were encountered while building the effective model for org.apache.myfaces.trinidad:trinidad-blank:war:2.0.1-SNAPSHOT
[WARNING] 'reporting.plugins.plugin.version' for org.codehaus.mojo:rat-maven-plugin is missing.
[WARNING] 
[WARNING] Some problems were encountered while building the effective model for org.apache.myfaces.trinidad:trinidad-demo:war:2.0.1-SNAPSHOT
[WARNING] 'reporting.plugins.plugin.version' for org.codehaus.mojo:rat-maven-plugin is missing.
[WARNING] 
[WARNING] Some problems were encountered while building the effective model for org.apache.myfaces.trinidad:trinidad-components-showcase:war:2.0.1-SNAPSHOT
[WARNING] 'build.plugins.plugin.version' for org.apache.maven.plugins:maven-war-plugin is
missing. @ line 134, column 29
[WARNING] 'build.plugins.plugin.version' for org.apache.maven.plugins:maven-eclipse-plugin
is missing. @ line 59, column 21
[WARNING] 'reporting.plugins.plugin.version' for org.codehaus.mojo:rat-maven-plugin is missing.
[WARNING] 
[WARNING] Some problems were encountered while building the effective model for org.apache.myfaces.trinidad:trinidad-example:pom:2.0.1-SNAPSHOT
[WARNING] 'reporting.plugins.plugin.version' for org.codehaus.mojo:rat-maven-plugin is missing.
[WARNING] 
[WARNING] Some problems were encountered while building the effective model for org.apache.myfaces.trinidad:trinidad:pom:2.0.1-SNAPSHOT
[WARNING] 'reporting.plugins.plugin.version' for org.codehaus.mojo:rat-maven-plugin is missing.
@ line 631, column 15
[WARNING] 
[WARNING] It is highly recommended to fix these problems because they threaten the stability
of your build.
[WARNING] 
[WARNING] For this reason, future Maven versions might no longer support building such malformed
projects.
[WARNING] 
[INFO] Reactor Build Order:
[INFO] 
[INFO] Apache MyFaces Trinidad 2.0
[INFO] Apache MyFaces Trinidad Build
[INFO] Apache MyFaces Trinidad API
[INFO] Apache MyFaces Trinidad Impl
[INFO] Apache MyFaces Trinidad Examples
[INFO] Apache MyFaces Trinidad Blank Demo
[INFO] Apache MyFaces Trinidad Demo
[INFO] Apache MyFaces Trinidad Components Showcase
[INFO]                                                                         
[INFO] ------------------------------------------------------------------------
[INFO] Building Apache MyFaces Trinidad 2.0 2.0.1-SNAPSHOT
[INFO] ------------------------------------------------------------------------
Downloading: http://repo1.maven.org/maven2/org/apache/myfaces/trinidadbuild/maven-xrts-plugin/2.0.6/maven-xrts-plugin-2.0.6.pom
[WARNING] The POM for org.apache.myfaces.trinidadbuild:maven-xrts-plugin:jar:2.0.6 is missing,
no dependency information available
projectFailed org.apache.myfaces.trinidad:trinidad:2.0.1-SNAPSHOT
[JENKINS] Archiving <https://builds.apache.org/job/myfaces-trinidad-core-2/ws/pom.xml>
to /home/hudson/hudson/jobs/myfaces-trinidad-core-2/modules/org.apache.myfaces.trinidad$trinidad/builds/2011-06-25_02-21-22/archive/org.apache.myfaces.trinidad/trinidad/2.0.1-SNAPSHOT/trinidad-2.0.1-SNAPSHOT.pom
sessionEnded
[INFO] ------------------------------------------------------------------------
[INFO] Reactor Summary:
[INFO] 
[INFO] Apache MyFaces Trinidad 2.0 ....................... FAILURE [2.597s]
[INFO] Apache MyFaces Trinidad Build ..................... SKIPPED
[INFO] Apache MyFaces Trinidad API ....................... SKIPPED
[INFO] Apache MyFaces Trinidad Impl ...................... SKIPPED
[INFO] Apache MyFaces Trinidad Examples .................. SKIPPED
[INFO] Apache MyFaces Trinidad Blank Demo ................ SKIPPED
[INFO] Apache MyFaces Trinidad Demo ...................... SKIPPED
[INFO] Apache MyFaces Trinidad Components Showcase ....... SKIPPED
[INFO] ------------------------------------------------------------------------
[INFO] BUILD FAILURE
[INFO] ------------------------------------------------------------------------
[INFO] Total time: 56.081s
[INFO] Finished at: Sat Jun 25 02:26:05 GMT+00:00 2011
[INFO] Final Memory: 6M/79M
[INFO] ------------------------------------------------------------------------
mavenExecutionResult exceptions not empty
message : Plugin org.apache.myfaces.trinidadbuild:maven-xrts-plugin:2.0.6 or one of its dependencies
could not be resolved: Failed to read artifact descriptor for org.apache.myfaces.trinidadbuild:maven-xrts-plugin:jar:2.0.6
cause : Failed to read artifact descriptor for org.apache.myfaces.trinidadbuild:maven-xrts-plugin:jar:2.0.6
Stack trace : 
org.apache.maven.plugin.PluginResolutionException: Plugin org.apache.myfaces.trinidadbuild:maven-xrts-plugin:2.0.6
or one of its dependencies could not be resolved: Failed to read artifact descriptor for org.apache.myfaces.trinidadbuild:maven-xrts-plugin:jar:2.0.6
	at org.apache.maven.plugin.internal.DefaultPluginDependenciesResolver.resolve(DefaultPluginDependenciesResolver.java:122)
	at org.apache.maven.plugin.internal.DefaultMavenPluginManager.getPluginDescriptor(DefaultMavenPluginManager.java:142)
	at org.apache.maven.plugin.internal.DefaultMavenPluginManager.getMojoDescriptor(DefaultMavenPluginManager.java:261)
	at org.apache.maven.plugin.DefaultBuildPluginManager.getMojoDescriptor(DefaultBuildPluginManager.java:192)
	at org.apache.maven.lifecycle.internal.DefaultLifecycleExecutionPlanCalculator.calculateLifecycleMappings(DefaultLifecycleExecutionPlanCalculator.java:263)
	at org.apache.maven.lifecycle.internal.DefaultLifecycleExecutionPlanCalculator.calculateMojoExecutions(DefaultLifecycleExecutionPlanCalculator.java:176)
	at org.apache.maven.lifecycle.internal.DefaultLifecycleExecutionPlanCalculator.calculateExecutionPlan(DefaultLifecycleExecutionPlanCalculator.java:114)
	at org.apache.maven.lifecycle.internal.BuilderCommon.resolveBuildPlan(BuilderCommon.java:92)
	at org.apache.maven.lifecycle.internal.LifecycleModuleBuilder.buildProject(LifecycleModuleBuilder.java:81)
	at org.apache.maven.lifecycle.internal.LifecycleModuleBuilder.buildProject(LifecycleModuleBuilder.java:59)
	at org.apache.maven.lifecycle.internal.LifecycleStarter.singleThreadedBuild(LifecycleStarter.java:183)
	at org.apache.maven.lifecycle.internal.LifecycleStarter.execute(LifecycleStarter.java:161)
	at org.apache.maven.DefaultMaven.doExecute(DefaultMaven.java:319)
	at org.apache.maven.DefaultMaven.execute(DefaultMaven.java:156)
	at org.jvnet.hudson.maven3.launcher.Maven3Launcher.main(Maven3Launcher.java:79)
	at sun.reflect.NativeMethodAccessorImpl.invoke0(Native Method)
	at sun.reflect.NativeMethodAccessorImpl.invoke(NativeMethodAccessorImpl.java:39)
	at sun.reflect.DelegatingMethodAccessorImpl.invoke(DelegatingMethodAccessorImpl.java:25)
	at java.lang.reflect.Method.invoke(Method.java:597)
	at org.codehaus.plexus.classworlds.launcher.Launcher.launchStandard(Launcher.java:329)
	at org.codehaus.plexus.classworlds.launcher.Launcher.launch(Launcher.java:239)
	at org.jvnet.hudson.maven3.agent.Maven3Main.launch(Maven3Main.java:158)
	at hudson.maven.Maven3Builder.call(Maven3Builder.java:128)
	at hudson.maven.Maven3Builder.call(Maven3Builder.java:75)
	at hudson.remoting.UserRequest.perform(UserRequest.java:118)
	at hudson.remoting.UserRequest.perform(UserRequest.java:48)
	at hudson.remoting.Request$2.run(Request.java:270)
	at java.util.concurrent.Executors$RunnableAdapter.call(Executors.java:441)
	at java.util.concurrent.FutureTask$Sync.innerRun(FutureTask.java:303)
	at java.util.concurrent.FutureTask.run(FutureTask.java:138)
	at java.util.concurrent.ThreadPoolExecutor$Worker.runTask(ThreadPoolExecutor.java:886)
	at java.util.concurrent.ThreadPoolExecutor$Worker.run(ThreadPoolExecutor.java:908)
	at java.lang.Thread.run(Thread.java:662)
Caused by: org.sonatype.aether.resolution.ArtifactDescriptorException: Failed to read artifact
descriptor for org.apache.myfaces.trinidadbuild:maven-xrts-plugin:jar:2.0.6
	at org.apache.maven.repository.internal.DefaultArtifactDescriptorReader.loadPom(DefaultArtifactDescriptorReader.java:283)
	at org.apache.maven.repository.internal.DefaultArtifactDescriptorReader.readArtifactDescriptor(DefaultArtifactDescriptorReader.java:173)
	at org.sonatype.aether.impl.internal.DefaultRepositorySystem.readArtifactDescriptor(DefaultRepositorySystem.java:289)
	at org.apache.maven.plugin.internal.DefaultPluginDependenciesResolver.resolve(DefaultPluginDependenciesResolver.java:108)
	... 32 more
Caused by: org.sonatype.aether.resolution.ArtifactResolutionException: Could not find artifact
org.apache.myfaces.trinidadbuild:maven-xrts-plugin:pom:2.0.6 in central (http://repo1.maven.org/maven2)
	at org.sonatype.aether.impl.internal.DefaultArtifactResolver.resolveArtifacts(DefaultArtifactResolver.java:526)
	at org.sonatype.aether.impl.internal.DefaultArtifactResolver.resolveArtifact(DefaultArtifactResolver.java:214)
	at org.apache.maven.repository.internal.DefaultArtifactDescriptorReader.loadPom(DefaultArtifactDescriptorReader.java:268)
	... 35 more
Caused by: org.sonatype.aether.transfer.ArtifactNotFoundException: Could not find artifact
org.apache.myfaces.trinidadbuild:maven-xrts-plugin:pom:2.0.6 in central (http://repo1.maven.org/maven2)
	at org.sonatype.aether.connector.wagon.WagonRepositoryConnector$4.wrap(WagonRepositoryConnector.java:945)
	at org.sonatype.aether.connector.wagon.WagonRepositoryConnector$4.wrap(WagonRepositoryConnector.java:940)
	at org.sonatype.aether.connector.wagon.WagonRepositoryConnector$GetTask.flush(WagonRepositoryConnector.java:696)
	at org.sonatype.aether.connector.wagon.WagonRepositoryConnector$GetTask.flush(WagonRepositoryConnector.java:690)
	at org.sonatype.aether.connector.wagon.WagonRepositoryConnector.get(WagonRepositoryConnector.java:435)
	at org.sonatype.aether.impl.internal.DefaultArtifactResolver.resolveArtifacts(DefaultArtifactResolver.java:438)
	... 37 more
Sending e-mails to: commits@myfaces.apache.org
channel stopped


Mime
View raw message