myfaces-commits mailing list archives

Site index · List index
Message view « Date » · « Thread »
Top « Date » · « Thread »
From Apache Jenkins Server <hud...@hudson.apache.org>
Subject Build failed in Jenkins: tobago-trunk-deploy #104
Date Thu, 05 May 2011 00:25:47 GMT
See <https://builds.apache.org/hudson/job/tobago-trunk-deploy/104/changes>

Changes:

[lofwyr] TOBAGO-993: tx:label not working in facelets
 - adding some documentation

[lofwyr] TOBAGO-993: tx:label not working in facelets
 - test example

[lofwyr] TOBAGO-860: Make Popup work with new LayoutManager
 - auto-position was computed wrong

[lofwyr] TOBAGO-995: TextArea applies always style class tobago-TextArea-required, if length
validator is present
 - patch applied

------------------------------------------
[...truncated 3130 lines...]
ERROR: Failed to parse svn info for external https://svn.apache.org/repos/asf/myfaces/tobago/trunk/tobago-core/src/main/resources/org/apache/myfaces/tobago/config/tobago-config-1.0.29.dtd
at trunk-deploy/src/site/resources//tobago-config-1.0.29.dtd
org.tmatesoft.svn.core.SVNException: svn: '<https://builds.apache.org/hudson/job/tobago-trunk-deploy/ws/trunk-deploy/src/site/resources/tobago-config-1.0.29.dtd'>
is not under version control
	at org.tmatesoft.svn.core.internal.wc.SVNErrorManager.error(SVNErrorManager.java:64)
	at org.tmatesoft.svn.core.internal.wc.SVNErrorManager.error(SVNErrorManager.java:51)
	at org.tmatesoft.svn.core.wc.SVNWCClient$13.handleError(SVNWCClient.java:3314)
	at org.tmatesoft.svn.core.internal.wc.admin.SVNWCAccess.walkEntries(SVNWCAccess.java:758)
	at org.tmatesoft.svn.core.internal.wc.admin.SVNWCAccess.walkEntries(SVNWCAccess.java:741)
	at org.tmatesoft.svn.core.wc.SVNWCClient.crawlEntries(SVNWCClient.java:3294)
	at org.tmatesoft.svn.core.wc.SVNWCClient.doInfo(SVNWCClient.java:2498)
	at org.tmatesoft.svn.core.wc.SVNWCClient.doInfo(SVNWCClient.java:2865)
	at hudson.scm.SubversionSCM$BuildRevisionMapTask.invoke(SubversionSCM.java:934)
	at hudson.scm.SubversionSCM$BuildRevisionMapTask.invoke(SubversionSCM.java:904)
	at hudson.FilePath$FileCallableWrapper.call(FilePath.java:1957)
	at hudson.remoting.UserRequest.perform(UserRequest.java:118)
	at hudson.remoting.UserRequest.perform(UserRequest.java:48)
	at hudson.remoting.Request$2.run(Request.java:270)
	at java.util.concurrent.Executors$RunnableAdapter.call(Executors.java:417)
	at java.util.concurrent.FutureTask$Sync.innerRun(FutureTask.java:269)
	at java.util.concurrent.FutureTask.run(FutureTask.java:123)
	at java.util.concurrent.ThreadPoolExecutor$Worker.runTask(ThreadPoolExecutor.java:651)
	at java.util.concurrent.ThreadPoolExecutor$Worker.run(ThreadPoolExecutor.java:676)
	at java.lang.Thread.run(Thread.java:595)
Caused by: org.tmatesoft.svn.core.SVNErrorMessage: svn: '<https://builds.apache.org/hudson/job/tobago-trunk-deploy/ws/trunk-deploy/src/site/resources/tobago-config-1.0.29.dtd'>
is not under version control
	at org.tmatesoft.svn.core.SVNErrorMessage.create(SVNErrorMessage.java:163)
	at org.tmatesoft.svn.core.SVNErrorMessage.create(SVNErrorMessage.java:118)
	... 17 more
ERROR: Failed to parse svn info for external https://svn.apache.org/repos/asf/myfaces/tobago/trunk/tobago-core/src/main/resources/org/apache/myfaces/tobago/config/tobago-config-1.0.30.dtd
at trunk-deploy/src/site/resources//tobago-config-1.0.30.dtd
org.tmatesoft.svn.core.SVNException: svn: '<https://builds.apache.org/hudson/job/tobago-trunk-deploy/ws/trunk-deploy/src/site/resources/tobago-config-1.0.30.dtd'>
is not under version control
	at org.tmatesoft.svn.core.internal.wc.SVNErrorManager.error(SVNErrorManager.java:64)
	at org.tmatesoft.svn.core.internal.wc.SVNErrorManager.error(SVNErrorManager.java:51)
	at org.tmatesoft.svn.core.wc.SVNWCClient$13.handleError(SVNWCClient.java:3314)
	at org.tmatesoft.svn.core.internal.wc.admin.SVNWCAccess.walkEntries(SVNWCAccess.java:758)
	at org.tmatesoft.svn.core.internal.wc.admin.SVNWCAccess.walkEntries(SVNWCAccess.java:741)
	at org.tmatesoft.svn.core.wc.SVNWCClient.crawlEntries(SVNWCClient.java:3294)
	at org.tmatesoft.svn.core.wc.SVNWCClient.doInfo(SVNWCClient.java:2498)
	at org.tmatesoft.svn.core.wc.SVNWCClient.doInfo(SVNWCClient.java:2865)
	at hudson.scm.SubversionSCM$BuildRevisionMapTask.invoke(SubversionSCM.java:934)
	at hudson.scm.SubversionSCM$BuildRevisionMapTask.invoke(SubversionSCM.java:904)
	at hudson.FilePath$FileCallableWrapper.call(FilePath.java:1957)
	at hudson.remoting.UserRequest.perform(UserRequest.java:118)
	at hudson.remoting.UserRequest.perform(UserRequest.java:48)
	at hudson.remoting.Request$2.run(Request.java:270)
	at java.util.concurrent.Executors$RunnableAdapter.call(Executors.java:417)
	at java.util.concurrent.FutureTask$Sync.innerRun(FutureTask.java:269)
	at java.util.concurrent.FutureTask.run(FutureTask.java:123)
	at java.util.concurrent.ThreadPoolExecutor$Worker.runTask(ThreadPoolExecutor.java:651)
	at java.util.concurrent.ThreadPoolExecutor$Worker.run(ThreadPoolExecutor.java:676)
	at java.lang.Thread.run(Thread.java:595)
Caused by: org.tmatesoft.svn.core.SVNErrorMessage: svn: '<https://builds.apache.org/hudson/job/tobago-trunk-deploy/ws/trunk-deploy/src/site/resources/tobago-config-1.0.30.dtd'>
is not under version control
	at org.tmatesoft.svn.core.SVNErrorMessage.create(SVNErrorMessage.java:163)
	at org.tmatesoft.svn.core.SVNErrorMessage.create(SVNErrorMessage.java:118)
	... 17 more
ERROR: Failed to parse svn info for external https://svn.apache.org/repos/asf/myfaces/tobago/trunk/tobago-core/src/main/resources/org/apache/myfaces/tobago/config/tobago-config-1.0.34.dtd
at trunk-deploy/src/site/resources//tobago-config-1.0.34.dtd
org.tmatesoft.svn.core.SVNException: svn: '<https://builds.apache.org/hudson/job/tobago-trunk-deploy/ws/trunk-deploy/src/site/resources/tobago-config-1.0.34.dtd'>
is not under version control
	at org.tmatesoft.svn.core.internal.wc.SVNErrorManager.error(SVNErrorManager.java:64)
	at org.tmatesoft.svn.core.internal.wc.SVNErrorManager.error(SVNErrorManager.java:51)
	at org.tmatesoft.svn.core.wc.SVNWCClient$13.handleError(SVNWCClient.java:3314)
	at org.tmatesoft.svn.core.internal.wc.admin.SVNWCAccess.walkEntries(SVNWCAccess.java:758)
	at org.tmatesoft.svn.core.internal.wc.admin.SVNWCAccess.walkEntries(SVNWCAccess.java:741)
	at org.tmatesoft.svn.core.wc.SVNWCClient.crawlEntries(SVNWCClient.java:3294)
	at org.tmatesoft.svn.core.wc.SVNWCClient.doInfo(SVNWCClient.java:2498)
	at org.tmatesoft.svn.core.wc.SVNWCClient.doInfo(SVNWCClient.java:2865)
	at hudson.scm.SubversionSCM$BuildRevisionMapTask.invoke(SubversionSCM.java:934)
	at hudson.scm.SubversionSCM$BuildRevisionMapTask.invoke(SubversionSCM.java:904)
	at hudson.FilePath$FileCallableWrapper.call(FilePath.java:1957)
	at hudson.remoting.UserRequest.perform(UserRequest.java:118)
	at hudson.remoting.UserRequest.perform(UserRequest.java:48)
	at hudson.remoting.Request$2.run(Request.java:270)
	at java.util.concurrent.Executors$RunnableAdapter.call(Executors.java:417)
	at java.util.concurrent.FutureTask$Sync.innerRun(FutureTask.java:269)
	at java.util.concurrent.FutureTask.run(FutureTask.java:123)
	at java.util.concurrent.ThreadPoolExecutor$Worker.runTask(ThreadPoolExecutor.java:651)
	at java.util.concurrent.ThreadPoolExecutor$Worker.run(ThreadPoolExecutor.java:676)
	at java.lang.Thread.run(Thread.java:595)
Caused by: org.tmatesoft.svn.core.SVNErrorMessage: svn: '<https://builds.apache.org/hudson/job/tobago-trunk-deploy/ws/trunk-deploy/src/site/resources/tobago-config-1.0.34.dtd'>
is not under version control
	at org.tmatesoft.svn.core.SVNErrorMessage.create(SVNErrorMessage.java:163)
	at org.tmatesoft.svn.core.SVNErrorMessage.create(SVNErrorMessage.java:118)
	... 17 more
ERROR: Failed to parse svn info for external https://svn.apache.org/repos/asf/myfaces/tobago/trunk/tobago-core/src/main/resources/org/apache/myfaces/tobago/config/tobago-config-1.5.dtd
at trunk-deploy/src/site/resources//tobago-config-1.5.dtd
org.tmatesoft.svn.core.SVNException: svn: '<https://builds.apache.org/hudson/job/tobago-trunk-deploy/ws/trunk-deploy/src/site/resources/tobago-config-1.5.dtd'>
is not under version control
	at org.tmatesoft.svn.core.internal.wc.SVNErrorManager.error(SVNErrorManager.java:64)
	at org.tmatesoft.svn.core.internal.wc.SVNErrorManager.error(SVNErrorManager.java:51)
	at org.tmatesoft.svn.core.wc.SVNWCClient$13.handleError(SVNWCClient.java:3314)
	at org.tmatesoft.svn.core.internal.wc.admin.SVNWCAccess.walkEntries(SVNWCAccess.java:758)
	at org.tmatesoft.svn.core.internal.wc.admin.SVNWCAccess.walkEntries(SVNWCAccess.java:741)
	at org.tmatesoft.svn.core.wc.SVNWCClient.crawlEntries(SVNWCClient.java:3294)
	at org.tmatesoft.svn.core.wc.SVNWCClient.doInfo(SVNWCClient.java:2498)
	at org.tmatesoft.svn.core.wc.SVNWCClient.doInfo(SVNWCClient.java:2865)
	at hudson.scm.SubversionSCM$BuildRevisionMapTask.invoke(SubversionSCM.java:934)
	at hudson.scm.SubversionSCM$BuildRevisionMapTask.invoke(SubversionSCM.java:904)
	at hudson.FilePath$FileCallableWrapper.call(FilePath.java:1957)
	at hudson.remoting.UserRequest.perform(UserRequest.java:118)
	at hudson.remoting.UserRequest.perform(UserRequest.java:48)
	at hudson.remoting.Request$2.run(Request.java:270)
	at java.util.concurrent.Executors$RunnableAdapter.call(Executors.java:417)
	at java.util.concurrent.FutureTask$Sync.innerRun(FutureTask.java:269)
	at java.util.concurrent.FutureTask.run(FutureTask.java:123)
	at java.util.concurrent.ThreadPoolExecutor$Worker.runTask(ThreadPoolExecutor.java:651)
	at java.util.concurrent.ThreadPoolExecutor$Worker.run(ThreadPoolExecutor.java:676)
	at java.lang.Thread.run(Thread.java:595)
Caused by: org.tmatesoft.svn.core.SVNErrorMessage: svn: '<https://builds.apache.org/hudson/job/tobago-trunk-deploy/ws/trunk-deploy/src/site/resources/tobago-config-1.5.dtd'>
is not under version control
	at org.tmatesoft.svn.core.SVNErrorMessage.create(SVNErrorMessage.java:163)
	at org.tmatesoft.svn.core.SVNErrorMessage.create(SVNErrorMessage.java:118)
	... 17 more
ERROR: Failed to parse svn info for external https://svn.apache.org/repos/asf/myfaces/tobago/trunk/tobago-core/src/main/resources/org/apache/myfaces/tobago/config/tobago-config-1.5.xsd
at trunk-deploy/src/site/resources//tobago-config-1.5.xsd
org.tmatesoft.svn.core.SVNException: svn: '<https://builds.apache.org/hudson/job/tobago-trunk-deploy/ws/trunk-deploy/src/site/resources/tobago-config-1.5.xsd'>
is not under version control
	at org.tmatesoft.svn.core.internal.wc.SVNErrorManager.error(SVNErrorManager.java:64)
	at org.tmatesoft.svn.core.internal.wc.SVNErrorManager.error(SVNErrorManager.java:51)
	at org.tmatesoft.svn.core.wc.SVNWCClient$13.handleError(SVNWCClient.java:3314)
	at org.tmatesoft.svn.core.internal.wc.admin.SVNWCAccess.walkEntries(SVNWCAccess.java:758)
	at org.tmatesoft.svn.core.internal.wc.admin.SVNWCAccess.walkEntries(SVNWCAccess.java:741)
	at org.tmatesoft.svn.core.wc.SVNWCClient.crawlEntries(SVNWCClient.java:3294)
	at org.tmatesoft.svn.core.wc.SVNWCClient.doInfo(SVNWCClient.java:2498)
	at org.tmatesoft.svn.core.wc.SVNWCClient.doInfo(SVNWCClient.java:2865)
	at hudson.scm.SubversionSCM$BuildRevisionMapTask.invoke(SubversionSCM.java:934)
	at hudson.scm.SubversionSCM$BuildRevisionMapTask.invoke(SubversionSCM.java:904)
	at hudson.FilePath$FileCallableWrapper.call(FilePath.java:1957)
	at hudson.remoting.UserRequest.perform(UserRequest.java:118)
	at hudson.remoting.UserRequest.perform(UserRequest.java:48)
	at hudson.remoting.Request$2.run(Request.java:270)
	at java.util.concurrent.Executors$RunnableAdapter.call(Executors.java:417)
	at java.util.concurrent.FutureTask$Sync.innerRun(FutureTask.java:269)
	at java.util.concurrent.FutureTask.run(FutureTask.java:123)
	at java.util.concurrent.ThreadPoolExecutor$Worker.runTask(ThreadPoolExecutor.java:651)
	at java.util.concurrent.ThreadPoolExecutor$Worker.run(ThreadPoolExecutor.java:676)
	at java.lang.Thread.run(Thread.java:595)
Caused by: org.tmatesoft.svn.core.SVNErrorMessage: svn: '<https://builds.apache.org/hudson/job/tobago-trunk-deploy/ws/trunk-deploy/src/site/resources/tobago-config-1.5.xsd'>
is not under version control
	at org.tmatesoft.svn.core.SVNErrorMessage.create(SVNErrorMessage.java:163)
	at org.tmatesoft.svn.core.SVNErrorMessage.create(SVNErrorMessage.java:118)
	... 17 more
no revision recorded for null in the previous build
no revision recorded for null in the previous build
no revision recorded for null in the previous build
no revision recorded for null in the previous build
no revision recorded for null in the previous build
no revision recorded for null in the previous build
Found mavenVersion 2.2.1 from file jar:file:/home/hudson/tools/maven/latest/lib/maven-2.2.1-uber.jar!/META-INF/maven/org.apache.maven/maven-core/pom.properties
Parsing POMs
ERROR: Processing failed due to a bug in the code. Please report this to jenkinsci-users@googlegroups.com
com.google.inject.internal.util.$ComputationException: java.lang.NoClassDefFoundError
	at com.google.inject.internal.util.$MapMaker$StrategyImpl.compute(MapMaker.java:553)
	at com.google.inject.internal.util.$MapMaker$StrategyImpl.compute(MapMaker.java:419)
	at com.google.inject.internal.util.$CustomConcurrentHashMap$ComputingImpl.get(CustomConcurrentHashMap.java:2041)
	at com.google.inject.internal.FailableCache.get(FailableCache.java:50)
	at com.google.inject.internal.ConstructorInjectorStore.get(ConstructorInjectorStore.java:49)
	at com.google.inject.internal.ConstructorBindingImpl.initialize(ConstructorBindingImpl.java:125)
	at com.google.inject.internal.InjectorImpl.initializeBinding(InjectorImpl.java:507)
	at com.google.inject.internal.AbstractBindingProcessor$Processor$1.run(AbstractBindingProcessor.java:171)
	at com.google.inject.internal.ProcessedBindingData.initializeBindings(ProcessedBindingData.java:44)
	at com.google.inject.internal.InternalInjectorCreator.initializeStatically(InternalInjectorCreator.java:122)
	at com.google.inject.internal.InternalInjectorCreator.build(InternalInjectorCreator.java:106)
	at com.google.inject.Guice.createInjector(Guice.java:95)
	at com.google.inject.Guice.createInjector(Guice.java:72)
	at com.google.inject.Guice.createInjector(Guice.java:62)
	at org.codehaus.plexus.DefaultPlexusContainer.addPlexusInjector(DefaultPlexusContainer.java:454)
	at org.codehaus.plexus.DefaultPlexusContainer.<init>(DefaultPlexusContainer.java:190)
	at org.codehaus.plexus.DefaultPlexusContainer.<init>(DefaultPlexusContainer.java:157)
	at hudson.maven.MavenEmbedderUtils.buildPlexusContainer(MavenEmbedderUtils.java:164)
	at hudson.maven.MavenEmbedderUtils.buildPlexusContainer(MavenEmbedderUtils.java:157)
	at hudson.maven.MavenEmbedder.<init>(MavenEmbedder.java:111)
	at hudson.maven.MavenEmbedder.<init>(MavenEmbedder.java:138)
	at hudson.maven.MavenUtil.createEmbedder(MavenUtil.java:208)
	at hudson.maven.MavenModuleSetBuild$PomParser.invoke(MavenModuleSetBuild.java:1271)
	at hudson.maven.MavenModuleSetBuild$PomParser.invoke(MavenModuleSetBuild.java:1110)
	at hudson.FilePath$FileCallableWrapper.call(FilePath.java:1957)
	at hudson.remoting.UserRequest.perform(UserRequest.java:118)
	at hudson.remoting.UserRequest.perform(UserRequest.java:48)
	at hudson.remoting.Request$2.run(Request.java:270)
	at java.util.concurrent.Executors$RunnableAdapter.call(Executors.java:417)
	at java.util.concurrent.FutureTask$Sync.innerRun(FutureTask.java:269)
	at java.util.concurrent.FutureTask.run(FutureTask.java:123)
	at java.util.concurrent.ThreadPoolExecutor$Worker.runTask(ThreadPoolExecutor.java:651)
	at java.util.concurrent.ThreadPoolExecutor$Worker.run(ThreadPoolExecutor.java:676)
	at java.lang.Thread.run(Thread.java:595)
Caused by: java.lang.NoClassDefFoundError
	at com.google.inject.internal.cglib.core.$DuplicatesPredicate.evaluate(DuplicatesPredicate.java:25)
	at com.google.inject.internal.cglib.core.$CollectionUtils.filter(CollectionUtils.java:52)
	at com.google.inject.internal.cglib.reflect.$FastClassEmitter.<init>(FastClassEmitter.java:69)
	at com.google.inject.internal.cglib.reflect.$FastClass$Generator.generateClass(FastClass.java:72)
	at com.google.inject.internal.cglib.core.$DefaultGeneratorStrategy.generate(DefaultGeneratorStrategy.java:25)
	at com.google.inject.internal.cglib.core.$AbstractClassGenerator.create(AbstractClassGenerator.java:216)
	at com.google.inject.internal.cglib.reflect.$FastClass$Generator.create(FastClass.java:64)
	at com.google.inject.internal.BytecodeGen.newFastClass(BytecodeGen.java:214)
	at com.google.inject.internal.DefaultConstructionProxyFactory.create(DefaultConstructionProxyFactory.java:53)
	at com.google.inject.internal.ProxyFactory.create(ProxyFactory.java:153)
	at com.google.inject.internal.ConstructorInjectorStore.createConstructor(ConstructorInjectorStore.java:89)
	at com.google.inject.internal.ConstructorInjectorStore.access$000(ConstructorInjectorStore.java:28)
	at com.google.inject.internal.ConstructorInjectorStore$1.create(ConstructorInjectorStore.java:36)
	at com.google.inject.internal.ConstructorInjectorStore$1.create(ConstructorInjectorStore.java:32)
	at com.google.inject.internal.FailableCache$1.apply(FailableCache.java:39)
	at com.google.inject.internal.util.$MapMaker$StrategyImpl.compute(MapMaker.java:549)
	... 33 more
project=hudson.maven.MavenModuleSet@547ab2e8[tobago-trunk-deploy]
project.getModules()=[hudson.maven.MavenModule@52bd62c3[tobago-trunk-deploy/org.apache.myfaces.tobago:tobago][tobago-trunk-deploy/org.apache.myfaces.tobago:tobago][relativePath:],
hudson.maven.MavenModule@5bbd2184[tobago-trunk-deploy/org.apache.myfaces.tobago:tobago-assembly][tobago-trunk-deploy/org.apache.myfaces.tobago:tobago-assembly][relativePath:tobago-assembly],
hudson.maven.MavenModule@74dca977[tobago-trunk-deploy/org.apache.myfaces.tobago:tobago-core][tobago-trunk-deploy/org.apache.myfaces.tobago:tobago-core][relativePath:tobago-core],
hudson.maven.MavenModule@6425b780[tobago-trunk-deploy/org.apache.myfaces.tobago:tobago-deprecation][tobago-trunk-deploy/org.apache.myfaces.tobago:tobago-deprecation][relativePath:tobago-extension/tobago-deprecation],
hudson.maven.MavenModule@38c8c892[tobago-trunk-deploy/org.apache.myfaces.tobago:tobago-example][tobago-trunk-deploy/org.apache.myfaces.tobago:tobago-example][relativePath:tobago-example],
hudson.maven.MavenModule@10000ccd[tobago-trunk-deploy/org.apache.myfaces.tobago:tobago-example-addressbook][tobago-trunk-deploy/org.apache.myfaces.tobago:tobago-example-addressbook][relativePath:tobago-example/tobago-example-addressbook],
hudson.maven.MavenModule@6a9a9631[tobago-trunk-deploy/org.apache.myfaces.tobago:tobago-example-addressbook-lib][tobago-trunk-deploy/org.apache.myfaces.tobago:tobago-example-addressbook-lib][relativePath:tobago-example/tobago-example-addressbook-lib],
hudson.maven.MavenModule@1858c80c[tobago-trunk-deploy/org.apache.myfaces.tobago:tobago-example-assembly][tobago-trunk-deploy/org.apache.myfaces.tobago:tobago-example-assembly][relativePath:tobago-example/tobago-example-assembly],
hudson.maven.MavenModule@7c4b87f7[tobago-trunk-deploy/org.apache.myfaces.tobago:tobago-example-blank][tobago-trunk-deploy/org.apache.myfaces.tobago:tobago-example-blank][relativePath:tobago-example/tobago-example-blank],
hudson.maven.MavenModule@184e6efc[tobago-trunk-deploy/org.apache.myfaces.tobago:tobago-example-data][tobago-trunk-deploy/org.apache.myfaces.tobago:tobago-example-data][relativePath:tobago-example/tobago-example-data],
hudson.maven.MavenModule@12eb1882[tobago-trunk-deploy/org.apache.myfaces.tobago:tobago-example-demo][tobago-trunk-deploy/org.apache.myfaces.tobago:tobago-example-demo][relativePath:tobago-example/tobago-example-demo],
hudson.maven.MavenModule@640dee38[tobago-trunk-deploy/org.apache.myfaces.tobago:tobago-example-experimental][tobago-trunk-deploy/org.apache.myfaces.tobago:tobago-example-experimental][relativePath:tobago-example/tobago-example-experimental],
hudson.maven.MavenModule@14b25f37[tobago-trunk-deploy/org.apache.myfaces.tobago:tobago-example-nonfacesrequest][tobago-trunk-deploy/org.apache.myfaces.tobago:tobago-example-nonfacesrequest][relativePath:tobago-example/tobago-example-nonfacesrequest],
hudson.maven.MavenModule@4cb51c2d[tobago-trunk-deploy/org.apache.myfaces.tobago:tobago-example-test][tobago-trunk-deploy/org.apache.myfaces.tobago:tobago-example-test][relativePath:tobago-example/tobago-example-test],
hudson.maven.MavenModule@59d1d5d2[tobago-trunk-deploy/org.apache.myfaces.tobago:tobago-extension][tobago-trunk-deploy/org.apache.myfaces.tobago:tobago-extension][relativePath:tobago-extension],
hudson.maven.MavenModule@1b66a538[tobago-trunk-deploy/org.apache.myfaces.tobago:tobago-facelets][tobago-trunk-deploy/org.apache.myfaces.tobago:tobago-facelets][relativePath:tobago-extension/tobago-facelets],
hudson.maven.MavenModule@21ebfd82[tobago-trunk-deploy/org.apache.myfaces.tobago:tobago-fileupload][tobago-trunk-deploy/org.apache.myfaces.tobago:tobago-fileupload][relativePath:tobago-extension/tobago-fileupload],
hudson.maven.MavenModule@12f2eb18[tobago-trunk-deploy/org.apache.myfaces.tobago:tobago-jsf-compat][tobago-trunk-deploy/org.apache.myfaces.tobago:tobago-jsf-compat][relativePath:tobago-jsf-compat],
hudson.maven.MavenModule@33746634[tobago-trunk-deploy/org.apache.myfaces.tobago:tobago-sandbox][tobago-trunk-deploy/org.apache.myfaces.tobago:tobago-sandbox][relativePath:tobago-extension/tobago-sandbox],
hudson.maven.MavenModule@ba41381[tobago-trunk-deploy/org.apache.myfaces.tobago:tobago-security][tobago-trunk-deploy/org.apache.myfaces.tobago:tobago-security][relativePath:tobago-extension/tobago-security],
hudson.maven.MavenModule@37c039d1[tobago-trunk-deploy/org.apache.myfaces.tobago:tobago-taglib-extension][tobago-trunk-deploy/org.apache.myfaces.tobago:tobago-taglib-extension][relativePath:tobago-extension/tobago-taglib-extension],
hudson.maven.MavenModule@90580fa[tobago-trunk-deploy/org.apache.myfaces.tobago:tobago-theme][tobago-trunk-deploy/org.apache.myfaces.tobago:tobago-theme][relativePath:tobago-theme],
hudson.maven.MavenModule@374f1544[tobago-trunk-deploy/org.apache.myfaces.tobago:tobago-theme-charlotteville][tobago-trunk-deploy/org.apache.myfaces.tobago:tobago-theme-charlotteville][relativePath:tobago-theme/tobago-theme-charlotteville],
hudson.maven.MavenModule@13d344e7[tobago-trunk-deploy/org.apache.myfaces.tobago:tobago-theme-richmond][tobago-trunk-deploy/org.apache.myfaces.tobago:tobago-theme-richmond][relativePath:tobago-theme/tobago-theme-richmond],
hudson.maven.MavenModule@22c0468e[tobago-trunk-deploy/org.apache.myfaces.tobago:tobago-theme-scarborough][tobago-trunk-deploy/org.apache.myfaces.tobago:tobago-theme-scarborough][relativePath:tobago-theme/tobago-theme-scarborough],
hudson.maven.MavenModule@71e8de2f[tobago-trunk-deploy/org.apache.myfaces.tobago:tobago-theme-speyside][tobago-trunk-deploy/org.apache.myfaces.tobago:tobago-theme-speyside][relativePath:tobago-theme/tobago-theme-speyside],
hudson.maven.MavenModule@923ef32[tobago-trunk-deploy/org.apache.myfaces.tobago:tobago-theme-standard][tobago-trunk-deploy/org.apache.myfaces.tobago:tobago-theme-standard][relativePath:tobago-theme/tobago-theme-standard],
hudson.maven.MavenModule@77dbc064[tobago-trunk-deploy/org.apache.myfaces.tobago:tobago-tool][tobago-trunk-deploy/org.apache.myfaces.tobago:tobago-tool][relativePath:tobago-tool],
hudson.maven.MavenModule@22542822[tobago-trunk-deploy/org.apache.myfaces.tobago:tobago-tool-annotation][tobago-trunk-deploy/org.apache.myfaces.tobago:tobago-tool-annotation][relativePath:tobago-tool/tobago-tool-annotation],
hudson.maven.MavenModule@5a538af7[tobago-trunk-deploy/org.apache.myfaces.tobago:tobago-tool-apt][tobago-trunk-deploy/org.apache.myfaces.tobago:tobago-tool-apt][relativePath:tobago-tool/tobago-tool-apt]]
project.getRootModule()=hudson.maven.MavenModule@52bd62c3[tobago-trunk-deploy/org.apache.myfaces.tobago:tobago][tobago-trunk-deploy/org.apache.myfaces.tobago:tobago][relativePath:]
FATAL: java.lang.NoClassDefFoundError
com.google.inject.internal.util.$ComputationException: java.lang.NoClassDefFoundError
	at com.google.inject.internal.util.$MapMaker$StrategyImpl.compute(MapMaker.java:553)
	at com.google.inject.internal.util.$MapMaker$StrategyImpl.compute(MapMaker.java:419)
	at com.google.inject.internal.util.$CustomConcurrentHashMap$ComputingImpl.get(CustomConcurrentHashMap.java:2041)
	at com.google.inject.internal.FailableCache.get(FailableCache.java:50)
	at com.google.inject.internal.ConstructorInjectorStore.get(ConstructorInjectorStore.java:49)
	at com.google.inject.internal.ConstructorBindingImpl.initialize(ConstructorBindingImpl.java:125)
	at com.google.inject.internal.InjectorImpl.initializeBinding(InjectorImpl.java:507)
	at com.google.inject.internal.AbstractBindingProcessor$Processor$1.run(AbstractBindingProcessor.java:171)
	at com.google.inject.internal.ProcessedBindingData.initializeBindings(ProcessedBindingData.java:44)
	at com.google.inject.internal.InternalInjectorCreator.initializeStatically(InternalInjectorCreator.java:122)
	at com.google.inject.internal.InternalInjectorCreator.build(InternalInjectorCreator.java:106)
	at com.google.inject.Guice.createInjector(Guice.java:95)
	at com.google.inject.Guice.createInjector(Guice.java:72)
	at com.google.inject.Guice.createInjector(Guice.java:62)
	at org.codehaus.plexus.DefaultPlexusContainer.addPlexusInjector(DefaultPlexusContainer.java:454)
	at org.codehaus.plexus.DefaultPlexusContainer.<init>(DefaultPlexusContainer.java:190)
	at org.codehaus.plexus.DefaultPlexusContainer.<init>(DefaultPlexusContainer.java:157)
	at hudson.maven.MavenEmbedderUtils.buildPlexusContainer(MavenEmbedderUtils.java:164)
	at hudson.maven.MavenEmbedderUtils.buildPlexusContainer(MavenEmbedderUtils.java:157)
	at hudson.maven.MavenEmbedder.<init>(MavenEmbedder.java:111)
	at hudson.maven.MavenEmbedder.<init>(MavenEmbedder.java:138)
	at hudson.maven.MavenUtil.createEmbedder(MavenUtil.java:208)
	at hudson.maven.MavenModuleSetBuild$PomParser.invoke(MavenModuleSetBuild.java:1271)
	at hudson.maven.MavenModuleSetBuild$PomParser.invoke(MavenModuleSetBuild.java:1110)
	at hudson.FilePath$FileCallableWrapper.call(FilePath.java:1957)
	at hudson.remoting.UserRequest.perform(UserRequest.java:118)
	at hudson.remoting.UserRequest.perform(UserRequest.java:48)
	at hudson.remoting.Request$2.run(Request.java:270)
	at java.util.concurrent.Executors$RunnableAdapter.call(Executors.java:417)
	at java.util.concurrent.FutureTask$Sync.innerRun(FutureTask.java:269)
	at java.util.concurrent.FutureTask.run(FutureTask.java:123)
	at java.util.concurrent.ThreadPoolExecutor$Worker.runTask(ThreadPoolExecutor.java:651)
	at java.util.concurrent.ThreadPoolExecutor$Worker.run(ThreadPoolExecutor.java:676)
	at java.lang.Thread.run(Thread.java:595)
Caused by: java.lang.NoClassDefFoundError
	at com.google.inject.internal.cglib.core.$DuplicatesPredicate.evaluate(DuplicatesPredicate.java:25)
	at com.google.inject.internal.cglib.core.$CollectionUtils.filter(CollectionUtils.java:52)
	at com.google.inject.internal.cglib.reflect.$FastClassEmitter.<init>(FastClassEmitter.java:69)
	at com.google.inject.internal.cglib.reflect.$FastClass$Generator.generateClass(FastClass.java:72)
	at com.google.inject.internal.cglib.core.$DefaultGeneratorStrategy.generate(DefaultGeneratorStrategy.java:25)
	at com.google.inject.internal.cglib.core.$AbstractClassGenerator.create(AbstractClassGenerator.java:216)
	at com.google.inject.internal.cglib.reflect.$FastClass$Generator.create(FastClass.java:64)
	at com.google.inject.internal.BytecodeGen.newFastClass(BytecodeGen.java:214)
	at com.google.inject.internal.DefaultConstructionProxyFactory.create(DefaultConstructionProxyFactory.java:53)
	at com.google.inject.internal.ProxyFactory.create(ProxyFactory.java:153)
	at com.google.inject.internal.ConstructorInjectorStore.createConstructor(ConstructorInjectorStore.java:89)
	at com.google.inject.internal.ConstructorInjectorStore.access$000(ConstructorInjectorStore.java:28)
	at com.google.inject.internal.ConstructorInjectorStore$1.create(ConstructorInjectorStore.java:36)
	at com.google.inject.internal.ConstructorInjectorStore$1.create(ConstructorInjectorStore.java:32)
	at com.google.inject.internal.FailableCache$1.apply(FailableCache.java:39)
	at com.google.inject.internal.util.$MapMaker$StrategyImpl.compute(MapMaker.java:549)
	... 33 more


Mime
View raw message