myfaces-commits mailing list archives

Site index · List index
Message view « Date » · « Thread »
Top « Date » · « Thread »
From Apache Hudson Server <hud...@hudson.apache.org>
Subject Build failed in Hudson: ExtVal for JSF 1.2 (nightly) » Apache MyFaces Extensions-Validator Project Parent #6
Date Wed, 06 Oct 2010 05:41:54 GMT
See <https://hudson.apache.org/hudson/job/ExtVal%20for%20JSF%201.2%20(nightly)/org.apache.myfaces.extensions.validator$myfaces-extval-parent/6/>

------------------------------------------
channel started<
===[HUDSON REMOTING CAPACITY]===>   Executing Maven:  -B -f /home/hudson/hudson-slave/workspace/ExtVal
for JSF 1.2 (nightly)/trunk/pom.xml clean install deploy
[INFO] Scanning for projects...
[INFO] Reactor build order: 
[INFO]   Apache MyFaces Extensions-Validator Project Parent
[INFO]   MyFaces Extensions-Validator Core
[INFO]   MyFaces Extensions-Validator Validation-Modules
[INFO]   MyFaces Extensions-Validator Property-Validation-Module
[INFO]   MyFaces Extensions-Validator Bean-Validation-Integration-Module (JSR 303)
[INFO]   MyFaces Extensions-Validator Component-Support Modules
[INFO]   MyFaces Extensions-Validator Trinidad Support Module
[INFO]   MyFaces Extensions-Validator Generic Support Module
[INFO]   MyFaces Extensions-Validator Test-Modules
[INFO]   MyFaces Extensions-Validator Base-Test-Infrastructure
[INFO]   MyFaces Extensions-Validator Core-Tests
[INFO]   MyFaces Extensions-Validator Property-Validation-Tests
[INFO]   MyFaces Extensions-Validator Bean-Validation-Integration-Tests
[INFO]   MyFaces Extensions-Validator Trinidad Component-Support-Tests
[INFO]   MyFaces Extensions-Validator examples project
[INFO]   MyFaces Extensions-Validator examples hello world
[INFO]   MyFaces Extensions-Validator examples hello bean-validation
[INFO]   MyFaces Extensions-Validator examples feature-set 01
[INFO]   MyFaces Extensions-Validator examples feature-set 02
[INFO]   Apache MyFaces Extensions-Validator Module
[INFO] ------------------------------------------------------------------------
[INFO] Building Apache MyFaces Extensions-Validator Project Parent
[INFO]    task-segment: [clean, install, deploy]
[INFO] ------------------------------------------------------------------------
[INFO] [clean:clean {execution: default-clean}]
[INFO] [antrun:run {execution: javadoc.resources}]
[INFO] Executing tasks
     [copy] Copying 2 files to <https://hudson.apache.org/hudson/job/ExtVal%20for%20JSF%201.2%20(nightly)/org.apache.myfaces.extensions.validator$myfaces-extval-parent/ws/target/apidocs/META-INF>
[INFO] Executed tasks
[INFO] [site:attach-descriptor {execution: default-attach-descriptor}]
[INFO] Preparing checkstyle:check
[INFO] Setting property: classpath.resource.loader.class => 'org.codehaus.plexus.velocity.ContextClassLoaderResourceLoader'.
[INFO] Setting property: velocimacro.messages.on => 'false'.
[INFO] Setting property: resource.loader => 'classpath'.
[INFO] Setting property: resource.manager.logwhenfound => 'false'.
[INFO] ************************************************************** 
[INFO] Starting Jakarta Velocity v1.4
[INFO] RuntimeInstance initializing.
[INFO] Default Properties File: org/apache/velocity/runtime/defaults/velocity.properties
[INFO] Default ResourceManager initializing. (class org.apache.velocity.runtime.resource.ResourceManagerImpl)
[INFO] Resource Loader Instantiated: org.codehaus.plexus.velocity.ContextClassLoaderResourceLoader
[INFO] ClasspathResourceLoader : initialization starting.
[INFO] ClasspathResourceLoader : initialization complete.
[INFO] ResourceCache : initialized. (class org.apache.velocity.runtime.resource.ResourceCacheImpl)
[INFO] Default ResourceManager initialization complete.
[INFO] Loaded System Directive: org.apache.velocity.runtime.directive.Literal
[INFO] Loaded System Directive: org.apache.velocity.runtime.directive.Macro
[INFO] Loaded System Directive: org.apache.velocity.runtime.directive.Parse
[INFO] Loaded System Directive: org.apache.velocity.runtime.directive.Include
[INFO] Loaded System Directive: org.apache.velocity.runtime.directive.Foreach
[INFO] Created: 20 parsers.
[INFO] Velocimacro : initialization starting.
[INFO] Velocimacro : adding VMs from VM library template : VM_global_library.vm
[ERROR] ResourceManager : unable to find resource 'VM_global_library.vm' in any resource loader.
[INFO] Velocimacro : error using  VM library template VM_global_library.vm : org.apache.velocity.exception.ResourceNotFoundException:
Unable to find resource 'VM_global_library.vm'
[INFO] Velocimacro :  VM library template macro registration complete.
[INFO] Velocimacro : allowInline = true : VMs can be defined inline in templates
[INFO] Velocimacro : allowInlineToOverride = false : VMs defined inline may NOT replace previous
VM definitions
[INFO] Velocimacro : allowInlineLocal = false : VMs defined inline will be  global in scope
if allowed.
[INFO] Velocimacro : initialization complete.
[INFO] Velocity successfully started.
[HUDSON] Archiving <https://hudson.apache.org/hudson/job/ExtVal%20for%20JSF%201.2%20(nightly)/org.apache.myfaces.extensions.validator$myfaces-extval-parent/ws/pom.xml>
to /home/hudson/hudson/jobs/ExtVal for JSF 1.2 (nightly)/modules/org.apache.myfaces.extensions.validator$myfaces-extval-parent/builds/2010-10-06_05-41-22/archive/org.apache.myfaces.extensions.validator/myfaces-extval-parent/1.2.4-SNAPSHOT/pom.xml
[INFO] [checkstyle:checkstyle {execution: checkstyle}]
[INFO] Source directory does not exist - skipping report.
[INFO] [checkstyle:check {execution: verify-style}]
[INFO] Unable to perform checkstyle:check, unable to find checkstyle:checkstyle outputFile.
[INFO] [install:install {execution: default-install}]
[INFO] Installing <https://hudson.apache.org/hudson/job/ExtVal%20for%20JSF%201.2%20(nightly)/org.apache.myfaces.extensions.validator$myfaces-extval-parent/ws/pom.xml>
to /home/hudson/.m2/repository/org/apache/myfaces/extensions/validator/myfaces-extval-parent/1.2.4-SNAPSHOT/myfaces-extval-parent-1.2.4-SNAPSHOT.pom
[INFO] [antrun:run {execution: javadoc.resources}]
[INFO] Executing tasks
[INFO] Executed tasks
[INFO] [site:attach-descriptor {execution: default-attach-descriptor}]
[INFO] Preparing checkstyle:check
[HUDSON] Archiving /home/hudson/.m2/repository/org/apache/myfaces/extensions/validator/myfaces-extval-parent/1.2.4-SNAPSHOT/myfaces-extval-parent-1.2.4-SNAPSHOT.pom
to /home/hudson/hudson/jobs/ExtVal for JSF 1.2 (nightly)/modules/org.apache.myfaces.extensions.validator$myfaces-extval-parent/builds/2010-10-06_05-41-22/archive/org.apache.myfaces.extensions.validator/myfaces-extval-parent/1.2.4-SNAPSHOT/myfaces-extval-parent-1.2.4-SNAPSHOT.pom
[INFO] [checkstyle:checkstyle {execution: checkstyle}]
[INFO] Source directory does not exist - skipping report.
[INFO] [checkstyle:check {execution: verify-style}]
[INFO] Unable to perform checkstyle:check, unable to find checkstyle:checkstyle outputFile.
[INFO] [install:install {execution: default-install}]
[INFO] Installing <https://hudson.apache.org/hudson/job/ExtVal%20for%20JSF%201.2%20(nightly)/org.apache.myfaces.extensions.validator$myfaces-extval-parent/ws/pom.xml>
to /home/hudson/.m2/repository/org/apache/myfaces/extensions/validator/myfaces-extval-parent/1.2.4-SNAPSHOT/myfaces-extval-parent-1.2.4-SNAPSHOT.pom
[INFO] [deploy:deploy {execution: default-deploy}]
[INFO] Retrieving previous build number from apache.snapshots
[INFO] ------------------------------------------------------------------------
[ERROR] BUILD ERROR
[INFO] ------------------------------------------------------------------------
[INFO] Error retrieving previous build number for artifact 'org.apache.myfaces.extensions.validator:myfaces-extval-parent:pom':
repository metadata for: 'snapshot org.apache.myfaces.extensions.validator:myfaces-extval-parent:1.2.4-SNAPSHOT'
could not be retrieved from repository: apache.snapshots due to an error: Exit code: 1 - 

Note that too many successive login failures will result in further
logins from your IP address being blocked. If this happens, contact
<infrastructure@apache.org>, mentioning your IP address so that it can
be unblocked.


Permission denied (publickey,keyboard-interactive).


[INFO] ------------------------------------------------------------------------
[INFO] For more information, run Maven with the -e switch
[INFO] ------------------------------------------------------------------------
[INFO] Total time: 21 seconds
[INFO] Finished at: Wed Oct 06 05:41:53 UTC 2010
[INFO] Final Memory: 19M/216M
[INFO] ------------------------------------------------------------------------


Mime
View raw message