myfaces-commits mailing list archives

Site index · List index
Message view « Date » · « Thread »
Top « Date » · « Thread »
From Apache Hudson Server <hud...@hudson.apache.org>
Subject Build failed in Hudson: tobago-1.0.x-deploy #15
Date Thu, 16 Sep 2010 07:53:56 GMT
See <https://hudson.apache.org/hudson/job/tobago-1.0.x-deploy/15/changes>

Changes:

[bommel] (TOBAGO-304) No horizontal scrollbar in tc:sheet when no data
(TOBAGO-901) On wide empty sheets not all columns are displayed

[bommel] fixed jdk 1.4 build and release build

------------------------------------------
[...truncated 4487 lines...]
     [java] 321  addressBook  TRACE  [main] openjpa.Enhance - Enhancing type "class org.apache.myfaces.tobago.example.addressbook.Address".
[INFO] Executed tasks
[INFO] [resources:testResources {execution: default-testResources}]
[INFO] Using 'UTF-8' encoding to copy filtered resources.
[INFO] skip non existing resourceDirectory <https://hudson.apache.org/hudson/job/tobago-1.0.x-deploy/ws/tobago-1.0.x-deploy/example/addressbook/lib/src/test/resources>
[INFO] Copying 3 resources
[INFO] [compiler:testCompile {execution: default-testCompile}]
[INFO] No sources to compile
[INFO] [surefire:test {execution: default-test}]
[INFO] Surefire report directory: <https://hudson.apache.org/hudson/job/tobago-1.0.x-deploy/ws/tobago-1.0.x-deploy/example/addressbook/lib/target/surefire-reports>

-------------------------------------------------------
 T E S T S
-------------------------------------------------------
There are no tests to run.

Results :

Tests run: 0, Failures: 0, Errors: 0, Skipped: 0

[HUDSON] Recording test results
[INFO] [jar:jar {execution: default-jar}]
[INFO] Building jar: <https://hudson.apache.org/hudson/job/tobago-1.0.x-deploy/ws/tobago-1.0.x-deploy/example/addressbook/lib/target/tobago-example-addressbook-lib-1.0.30-SNAPSHOT.jar>
[INFO] [assembly:single {execution: source-release-assembly}]
[INFO] Skipping the assembly in this project because it's not the Execution Root
[INFO] [install:install {execution: default-install}]
[INFO] Installing <https://hudson.apache.org/hudson/job/tobago-1.0.x-deploy/ws/tobago-1.0.x-deploy/example/addressbook/lib/target/tobago-example-addressbook-lib-1.0.30-SNAPSHOT.jar>
to /export/home/hudson/.m2/repository/org/apache/myfaces/tobago/tobago-example-addressbook-lib/1.0.30-SNAPSHOT/tobago-example-addressbook-lib-1.0.30-SNAPSHOT.jar
[INFO] Installing <https://hudson.apache.org/hudson/job/tobago-1.0.x-deploy/ws/tobago-1.0.x-deploy/example/addressbook/lib/target/tobago-example-addressbook-lib-1.0.30-SNAPSHOT-sources.jar>
to /export/home/hudson/.m2/repository/org/apache/myfaces/tobago/tobago-example-addressbook-lib/1.0.30-SNAPSHOT/tobago-example-addressbook-lib-1.0.30-SNAPSHOT-sources.jar
[INFO] [deploy:deploy {execution: default-deploy}]
[INFO] Retrieving previous build number from apache.snapshots.https
Uploading: https://repository.apache.org/content/repositories/snapshots/org/apache/myfaces/tobago/tobago-example-addressbook-lib/1.0.30-SNAPSHOT/tobago-example-addressbook-lib-1.0.30-SNAPSHOT.jar
106K uploaded  (tobago-example-addressbook-lib-1.0.30-SNAPSHOT.jar)
[INFO] Retrieving previous metadata from apache.snapshots.https
[INFO] Uploading repository metadata for: 'artifact org.apache.myfaces.tobago:tobago-example-addressbook-lib'
[INFO] Retrieving previous metadata from apache.snapshots.https
[INFO] Uploading repository metadata for: 'snapshot org.apache.myfaces.tobago:tobago-example-addressbook-lib:1.0.30-SNAPSHOT'
[INFO] Uploading project information for tobago-example-addressbook-lib 1.0.30-SNAPSHOT
[INFO] Retrieving previous build number from apache.snapshots.https
Uploading: https://repository.apache.org/content/repositories/snapshots/org/apache/myfaces/tobago/tobago-example-addressbook-lib/1.0.30-SNAPSHOT/tobago-example-addressbook-lib-1.0.30-SNAPSHOT-sources.jar
85K uploaded  (tobago-example-addressbook-lib-1.0.30-SNAPSHOT-sources.jar)
[HUDSON] Archiving <https://hudson.apache.org/hudson/job/tobago-1.0.x-deploy/ws/tobago-1.0.x-deploy/example/addressbook/lib/target/tobago-example-addressbook-lib-1.0.30-SNAPSHOT.jar>
to /home/hudson/hudson/jobs/tobago-1.0.x-deploy/modules/org.apache.myfaces.tobago$tobago-example-addressbook-lib/builds/2010-09-16_05-56-26/archive/org.apache.myfaces.tobago/tobago-example-addressbook-lib/1.0.30-SNAPSHOT/tobago-example-addressbook-lib-1.0.30-SNAPSHOT.jar
[HUDSON] Archiving <https://hudson.apache.org/hudson/job/tobago-1.0.x-deploy/ws/tobago-1.0.x-deploy/example/addressbook/lib/target/tobago-example-addressbook-lib-1.0.30-SNAPSHOT-sources.jar>
to /home/hudson/hudson/jobs/tobago-1.0.x-deploy/modules/org.apache.myfaces.tobago$tobago-example-addressbook-lib/builds/2010-09-16_05-56-26/archive/org.apache.myfaces.tobago/tobago-example-addressbook-lib/1.0.30-SNAPSHOT/tobago-example-addressbook-lib-1.0.30-SNAPSHOT-sources.jar
[INFO] ------------------------------------------------------------------------
[INFO] Building Example Addressbook Webapp
[INFO]    task-segment: [clean, source:jar, deploy]
[INFO] ------------------------------------------------------------------------
[INFO] [clean:clean {execution: default-clean}]
[INFO] Preparing source:jar
[HUDSON] Archiving <https://hudson.apache.org/hudson/job/tobago-1.0.x-deploy/ws/tobago-1.0.x-deploy/example/addressbook/war/pom.xml>
to /home/hudson/hudson/jobs/tobago-1.0.x-deploy/modules/org.apache.myfaces.tobago$tobago-example-addressbook-war/builds/2010-09-16_05-56-26/archive/org.apache.myfaces.tobago/tobago-example-addressbook-war/1.0.30-SNAPSHOT/pom.xml
[INFO] [buildnumber:create {execution: default}]
[INFO] [source:jar {execution: default-cli}]
[INFO] Building jar: <https://hudson.apache.org/hudson/job/tobago-1.0.x-deploy/ws/tobago-1.0.x-deploy/example/addressbook/war/target/tobago-example-addressbook-sources.jar>
[INFO] [buildnumber:create {execution: default}]
[INFO] [remote-resources:process {execution: default}]
[INFO] [resources:resources {execution: default-resources}]
[INFO] Using 'UTF-8' encoding to copy filtered resources.
[INFO] Copying 1 resource
[INFO] Copying 3 resources
[INFO] [compiler:compile {execution: default-compile}]
[INFO] Compiling 1 source file to <https://hudson.apache.org/hudson/job/tobago-1.0.x-deploy/ws/tobago-1.0.x-deploy/example/addressbook/war/target/classes>
[INFO] [resources:testResources {execution: default-testResources}]
[INFO] Using 'UTF-8' encoding to copy filtered resources.
[INFO] Copying 1 resource
[INFO] Copying 3 resources
[INFO] [compiler:testCompile {execution: default-testCompile}]
[INFO] No sources to compile
[INFO] [surefire:test {execution: default-test}]
[INFO] Surefire report directory: <https://hudson.apache.org/hudson/job/tobago-1.0.x-deploy/ws/tobago-1.0.x-deploy/example/addressbook/war/target/surefire-reports>
[HUDSON] Recording test results
-------------------------------------------------------
 T E S T S
-------------------------------------------------------
There are no tests to run.

Results :

Tests run: 0, Failures: 0, Errors: 0, Skipped: 0


[INFO] [war:war {execution: default-war}]
[INFO] Exploding webapp...
[INFO] Assembling webapp tobago-example-addressbook-war in <https://hudson.apache.org/hudson/job/tobago-1.0.x-deploy/ws/tobago-1.0.x-deploy/example/addressbook/war/target/tobago-example-addressbook>
[INFO] Copy webapp webResources to <https://hudson.apache.org/hudson/job/tobago-1.0.x-deploy/ws/tobago-1.0.x-deploy/example/addressbook/war/target/tobago-example-addressbook>
[INFO] Generating war <https://hudson.apache.org/hudson/job/tobago-1.0.x-deploy/ws/tobago-1.0.x-deploy/example/addressbook/war/target/tobago-example-addressbook.war>
[INFO] Building war: <https://hudson.apache.org/hudson/job/tobago-1.0.x-deploy/ws/tobago-1.0.x-deploy/example/addressbook/war/target/tobago-example-addressbook.war>
[INFO] [assembly:single {execution: source-release-assembly}]
[INFO] Skipping the assembly in this project because it's not the Execution Root
[INFO] [dependency:unpack {execution: unpack}]
[INFO] Configured Artifact: org.tango-project:tango-icon-theme:0.8.0:jar
[INFO] Unpacking /export/home/hudson/.m2/repository/org/tango-project/tango-icon-theme/0.8.0/tango-icon-theme-0.8.0.jarto
 <https://hudson.apache.org/hudson/job/tobago-1.0.x-deploy/ws/tobago-1.0.x-deploy/example/addressbook/war/target/tobago-example-addressbook/image>
with Includes null and excludes:null
[INFO] [install:install {execution: default-install}]
[INFO] Installing <https://hudson.apache.org/hudson/job/tobago-1.0.x-deploy/ws/tobago-1.0.x-deploy/example/addressbook/war/target/tobago-example-addressbook.war>
to /export/home/hudson/.m2/repository/org/apache/myfaces/tobago/tobago-example-addressbook-war/1.0.30-SNAPSHOT/tobago-example-addressbook-war-1.0.30-SNAPSHOT.war
[INFO] Installing <https://hudson.apache.org/hudson/job/tobago-1.0.x-deploy/ws/tobago-1.0.x-deploy/example/addressbook/war/target/tobago-example-addressbook-sources.jar>
to /export/home/hudson/.m2/repository/org/apache/myfaces/tobago/tobago-example-addressbook-war/1.0.30-SNAPSHOT/tobago-example-addressbook-war-1.0.30-SNAPSHOT-sources.jar
[INFO] [deploy:deploy {execution: default-deploy}]
[INFO] Retrieving previous build number from apache.snapshots.https
Uploading: https://repository.apache.org/content/repositories/snapshots/org/apache/myfaces/tobago/tobago-example-addressbook-war/1.0.30-SNAPSHOT/tobago-example-addressbook-war-1.0.30-SNAPSHOT.war
13500K uploaded  (tobago-example-addressbook-war-1.0.30-SNAPSHOT.war)
[INFO] Uploading project information for tobago-example-addressbook-war 1.0.30-SNAPSHOT
[INFO] Retrieving previous metadata from apache.snapshots.https
[INFO] Uploading repository metadata for: 'snapshot org.apache.myfaces.tobago:tobago-example-addressbook-war:1.0.30-SNAPSHOT'
[INFO] Retrieving previous metadata from apache.snapshots.https
[INFO] Uploading repository metadata for: 'artifact org.apache.myfaces.tobago:tobago-example-addressbook-war'
[INFO] Retrieving previous build number from apache.snapshots.https
Uploading: https://repository.apache.org/content/repositories/snapshots/org/apache/myfaces/tobago/tobago-example-addressbook-war/1.0.30-SNAPSHOT/tobago-example-addressbook-war-1.0.30-SNAPSHOT-sources.jar
3K uploaded  (tobago-example-addressbook-war-1.0.30-SNAPSHOT-sources.jar)
[HUDSON] Archiving <https://hudson.apache.org/hudson/job/tobago-1.0.x-deploy/ws/tobago-1.0.x-deploy/example/addressbook/war/target/tobago-example-addressbook.war>
to /home/hudson/hudson/jobs/tobago-1.0.x-deploy/modules/org.apache.myfaces.tobago$tobago-example-addressbook-war/builds/2010-09-16_05-56-26/archive/org.apache.myfaces.tobago/tobago-example-addressbook-war/1.0.30-SNAPSHOT/tobago-example-addressbook.war
[HUDSON] Archiving <https://hudson.apache.org/hudson/job/tobago-1.0.x-deploy/ws/tobago-1.0.x-deploy/example/addressbook/war/target/tobago-example-addressbook-sources.jar>
to /home/hudson/hudson/jobs/tobago-1.0.x-deploy/modules/org.apache.myfaces.tobago$tobago-example-addressbook-war/builds/2010-09-16_05-56-26/archive/org.apache.myfaces.tobago/tobago-example-addressbook-war/1.0.30-SNAPSHOT/tobago-example-addressbook-sources.jar
[INFO] ------------------------------------------------------------------------
[INFO] Building Example Blank
[INFO]    task-segment: [clean, source:jar, deploy]
[INFO] ------------------------------------------------------------------------
[INFO] [clean:clean {execution: default-clean}]
[INFO] Preparing source:jar
[HUDSON] Archiving <https://hudson.apache.org/hudson/job/tobago-1.0.x-deploy/ws/tobago-1.0.x-deploy/example/blank/pom.xml>
to /home/hudson/hudson/jobs/tobago-1.0.x-deploy/modules/org.apache.myfaces.tobago$tobago-example-blank/builds/2010-09-16_05-56-26/archive/org.apache.myfaces.tobago/tobago-example-blank/1.0.30-SNAPSHOT/pom.xml
[INFO] [buildnumber:create {execution: default}]
[INFO] [source:jar {execution: default-cli}]
[INFO] Building jar: <https://hudson.apache.org/hudson/job/tobago-1.0.x-deploy/ws/tobago-1.0.x-deploy/example/blank/target/tobago-example-blank-sources.jar>
[INFO] [buildnumber:create {execution: default}]
[INFO] [remote-resources:process {execution: default}]
[INFO] [resources:resources {execution: default-resources}]
[INFO] Using 'UTF-8' encoding to copy filtered resources.
[INFO] skip non existing resourceDirectory <https://hudson.apache.org/hudson/job/tobago-1.0.x-deploy/ws/tobago-1.0.x-deploy/example/blank/src/main/resources>
[INFO] Copying 3 resources
[INFO] [compiler:compile {execution: default-compile}]
[INFO] No sources to compile
[INFO] [resources:testResources {execution: default-testResources}]
[INFO] Using 'UTF-8' encoding to copy filtered resources.
[INFO] skip non existing resourceDirectory <https://hudson.apache.org/hudson/job/tobago-1.0.x-deploy/ws/tobago-1.0.x-deploy/example/blank/src/test/resources>
[INFO] Copying 3 resources
[INFO] [compiler:testCompile {execution: default-testCompile}]
[INFO] No sources to compile
[INFO] [surefire:test {execution: default-test}]
[INFO] Surefire report directory: <https://hudson.apache.org/hudson/job/tobago-1.0.x-deploy/ws/tobago-1.0.x-deploy/example/blank/target/surefire-reports>

-------------------------------------------------------
 T E S T S
-------------------------------------------------------
There are no tests to run.

Results :

Tests run: 0, Failures: 0, Errors: 0, Skipped: 0

[HUDSON] Recording test results
[INFO] [war:war {execution: default-war}]
[INFO] Exploding webapp...
[INFO] Assembling webapp tobago-example-blank in <https://hudson.apache.org/hudson/job/tobago-1.0.x-deploy/ws/tobago-1.0.x-deploy/example/blank/target/tobago-example-blank>
[INFO] Copy webapp webResources to <https://hudson.apache.org/hudson/job/tobago-1.0.x-deploy/ws/tobago-1.0.x-deploy/example/blank/target/tobago-example-blank>
[INFO] Generating war <https://hudson.apache.org/hudson/job/tobago-1.0.x-deploy/ws/tobago-1.0.x-deploy/example/blank/target/tobago-example-blank.war>
[INFO] Building war: <https://hudson.apache.org/hudson/job/tobago-1.0.x-deploy/ws/tobago-1.0.x-deploy/example/blank/target/tobago-example-blank.war>
[INFO] [assembly:single {execution: source-release-assembly}]
[INFO] Skipping the assembly in this project because it's not the Execution Root
[INFO] [install:install {execution: default-install}]
[INFO] Installing <https://hudson.apache.org/hudson/job/tobago-1.0.x-deploy/ws/tobago-1.0.x-deploy/example/blank/target/tobago-example-blank.war>
to /export/home/hudson/.m2/repository/org/apache/myfaces/tobago/tobago-example-blank/1.0.30-SNAPSHOT/tobago-example-blank-1.0.30-SNAPSHOT.war
[INFO] Installing <https://hudson.apache.org/hudson/job/tobago-1.0.x-deploy/ws/tobago-1.0.x-deploy/example/blank/target/tobago-example-blank-sources.jar>
to /export/home/hudson/.m2/repository/org/apache/myfaces/tobago/tobago-example-blank/1.0.30-SNAPSHOT/tobago-example-blank-1.0.30-SNAPSHOT-sources.jar
[INFO] [deploy:deploy {execution: default-deploy}]
[INFO] Retrieving previous build number from apache.snapshots.https
[INFO] repository metadata for: 'snapshot org.apache.myfaces.tobago:tobago-example-blank:1.0.30-SNAPSHOT'
could not be found on repository: apache.snapshots.https, so will be created
Uploading: https://repository.apache.org/content/repositories/snapshots/org/apache/myfaces/tobago/tobago-example-blank/1.0.30-SNAPSHOT/tobago-example-blank-1.0.30-SNAPSHOT.war
3736K uploaded  (tobago-example-blank-1.0.30-SNAPSHOT.war)
[INFO] Retrieving previous metadata from apache.snapshots.https
[INFO] repository metadata for: 'snapshot org.apache.myfaces.tobago:tobago-example-blank:1.0.30-SNAPSHOT'
could not be found on repository: apache.snapshots.https, so will be created
[INFO] Uploading repository metadata for: 'snapshot org.apache.myfaces.tobago:tobago-example-blank:1.0.30-SNAPSHOT'
[INFO] Retrieving previous metadata from apache.snapshots.https
[INFO] Uploading repository metadata for: 'artifact org.apache.myfaces.tobago:tobago-example-blank'
[INFO] Uploading project information for tobago-example-blank 1.0.30-SNAPSHOT
[INFO] Retrieving previous build number from apache.snapshots.https
Uploading: https://repository.apache.org/content/repositories/snapshots/org/apache/myfaces/tobago/tobago-example-blank/1.0.30-SNAPSHOT/tobago-example-blank-1.0.30-SNAPSHOT-sources.jar
327b uploaded  (tobago-example-blank-1.0.30-SNAPSHOT-sources.jar)
[HUDSON] Archiving <https://hudson.apache.org/hudson/job/tobago-1.0.x-deploy/ws/tobago-1.0.x-deploy/example/blank/target/tobago-example-blank.war>
to /home/hudson/hudson/jobs/tobago-1.0.x-deploy/modules/org.apache.myfaces.tobago$tobago-example-blank/builds/2010-09-16_05-56-26/archive/org.apache.myfaces.tobago/tobago-example-blank/1.0.30-SNAPSHOT/tobago-example-blank.war
[HUDSON] Archiving <https://hudson.apache.org/hudson/job/tobago-1.0.x-deploy/ws/tobago-1.0.x-deploy/example/blank/target/tobago-example-blank-sources.jar>
to /home/hudson/hudson/jobs/tobago-1.0.x-deploy/modules/org.apache.myfaces.tobago$tobago-example-blank/builds/2010-09-16_05-56-26/archive/org.apache.myfaces.tobago/tobago-example-blank/1.0.30-SNAPSHOT/tobago-example-blank-sources.jar
[INFO] ------------------------------------------------------------------------
[INFO] Building Data for Examples
[INFO]    task-segment: [clean, source:jar, deploy]
[INFO] ------------------------------------------------------------------------
[INFO] [clean:clean {execution: default-clean}]
[INFO] Preparing source:jar
[HUDSON] Archiving <https://hudson.apache.org/hudson/job/tobago-1.0.x-deploy/ws/tobago-1.0.x-deploy/example/data/pom.xml>
to /home/hudson/hudson/jobs/tobago-1.0.x-deploy/modules/org.apache.myfaces.tobago$tobago-example-data/builds/2010-09-16_05-56-26/archive/org.apache.myfaces.tobago/tobago-example-data/1.0.30-SNAPSHOT/pom.xml
[INFO] [buildnumber:create {execution: default}]
Build timed out. Aborting
[INFO] ------------------------------------------------------------------------
[ERROR] FATAL ERROR
[INFO] ------------------------------------------------------------------------
channel stopped
[INFO] hudson.remoting.RequestAbortedException: hudson.remoting.Channel$OrderlyShutdown
[INFO] ------------------------------------------------------------------------
[INFO] Trace
hudson.remoting.RequestAbortedException: hudson.remoting.RequestAbortedException: hudson.remoting.Channel$OrderlyShutdown
	at hudson.remoting.Request.call(Request.java:137)
	at hudson.remoting.Channel.call(Channel.java:557)
	at hudson.remoting.RemoteInvocationHandler.invoke(RemoteInvocationHandler.java:158)
	at $Proxy2.isArchivingDisabled(Unknown Source)
	at hudson.maven.MavenBuildProxy$Filter.isArchivingDisabled(MavenBuildProxy.java:222)
	at hudson.maven.reporters.MavenArtifact.archive(MavenArtifact.java:192)
	at hudson.maven.reporters.MavenArtifactArchiver.postBuild(MavenArtifactArchiver.java:109)
	at hudson.maven.MavenModuleSetBuild$Builder.postModule(MavenModuleSetBuild.java:731)
	at hudson.maven.MavenBuilder$Adapter.fireLeaveModule(MavenBuilder.java:317)
	at hudson.maven.MavenBuilder$Adapter.postBuild(MavenBuilder.java:275)
	at org.apache.maven.lifecycle.LifecycleExecutorInterceptor.execute(LifecycleExecutorInterceptor.java:68)
	at org.apache.maven.DefaultMaven.doExecute(DefaultMaven.java:328)
	at org.apache.maven.DefaultMaven.execute(DefaultMaven.java:138)
	at org.apache.maven.cli.MavenCli.main(MavenCli.java:362)
	at sun.reflect.NativeMethodAccessorImpl.invoke0(Native Method)
	at sun.reflect.NativeMethodAccessorImpl.invoke(NativeMethodAccessorImpl.java:39)
	at sun.reflect.DelegatingMethodAccessorImpl.invoke(DelegatingMethodAccessorImpl.java:25)
	at java.lang.reflect.Method.invoke(Method.java:585)
	at org.codehaus.classworlds.Launcher.launchEnhanced(Launcher.java:315)
	at org.codehaus.classworlds.Launcher.launch(Launcher.java:255)
	at hudson.maven.agent.Main.launch(Main.java:165)
	at hudson.maven.MavenBuilder.call(MavenBuilder.java:165)
	at hudson.maven.MavenModuleSetBuild$Builder.call(MavenModuleSetBuild.java:681)
	at hudson.maven.MavenModuleSetBuild$Builder.call(MavenModuleSetBuild.java:625)
	at hudson.remoting.UserRequest.perform(UserRequest.java:114)
	at hudson.remoting.UserRequest.perform(UserRequest.java:48)
	at hudson.remoting.Request$2.run(Request.java:270)
	at java.util.concurrent.Executors$RunnableAdapter.call(Executors.java:417)
	at java.util.concurrent.FutureTask$Sync.innerRun(FutureTask.java:269)
	at java.util.concurrent.FutureTask.run(FutureTask.java:123)
	at java.util.concurrent.ThreadPoolExecutor$Worker.runTask(ThreadPoolExecutor.java:650)
	at java.util.concurrent.ThreadPoolExecutor$Worker.run(ThreadPoolExecutor.java:675)
	at java.lang.Thread.run(Thread.java:595)
Caused by: hudson.remoting.RequestAbortedException: hudson.remoting.Channel$OrderlyShutdown
	at hudson.remoting.Request.abort(Request.java:257)
	at hudson.remoting.Channel.terminate(Channel.java:608)
	at hudson.remoting.Channel$CloseCommand.execute(Channel.java:691)
	at hudson.remoting.Channel$ReaderThread.run(Channel.java:890)
Caused by: hudson.remoting.Channel$OrderlyShutdown
	... 2 more
Caused by: Command close created at
	at hudson.remoting.Command.<init>(Command.java:58)
	at hudson.remoting.Command.<init>(Command.java:47)
	at hudson.remoting.Channel$CloseCommand.<init>(Channel.java:687)
	at hudson.remoting.Channel$CloseCommand.<init>(Channel.java:687)
	at hudson.remoting.Channel.close(Channel.java:732)
	at hudson.slaves.Channels$1.close(Channels.java:91)
	at hudson.maven.ProcessCache$MavenProcess.discard(ProcessCache.java:145)
	at hudson.maven.MavenModuleSetBuild$RunnerImpl.doRun(MavenModuleSetBuild.java:472)
	at hudson.model.AbstractBuild$AbstractRunner.run(AbstractBuild.java:416)
	at hudson.model.Run.run(Run.java:1272)
	at hudson.maven.MavenModuleSetBuild.run(MavenModuleSetBuild.java:291)
	at hudson.model.ResourceController.execute(ResourceController.java:88)
	at hudson.model.Executor.run(Executor.java:129)
[INFO] ------------------------------------------------------------------------
[INFO] Total time: 115 minutes 19 seconds
[INFO] Finished at: Thu Sep 16 07:54:55 GMT+00:00 2010
[INFO] Final Memory: 69M/278M
[INFO] ------------------------------------------------------------------------


Mime
View raw message