myfaces-commits mailing list archives

Site index · List index
Message view « Date » · « Thread »
Top « Date » · « Thread »
From "Continuum@myfaces.zones.apache.org" <comm...@myfaces.apache.org>
Subject [continuum] BUILD FAILURE: Tobago Facelets
Date Thu, 13 Mar 2008 14:47:33 GMT
Online report : http://myfaces.zones.apache.org:8080/continuum/buildResult.action?buildId=7431&projectId=27

Build statistics:
  State: Failed
  Previous State: Failed
  Started at: Thu 13 Mar 2008 14:46:11 +0000
  Finished at: Thu 13 Mar 2008 14:47:29 +0000
  Total time: 1m 18s
  Build Trigger: Schedule
  Build Number: 179
  Exit code: 1
  Building machine hostname: myfaces.zones.apache.org
  Operating system : SunOS(unknown)
  Java Home version : 
          java version "1.5.0_15"
          Java(TM) 2 Runtime Environment, Standard Edition (build 1.5.0_15-b04)
          Java HotSpot(TM) Server VM (build 1.5.0_15-b04, mixed mode)
        
  Builder version :
          Maven version: 2.0.8
          Java version: 1.5.0_15
          OS name: "sunos" version: "5.10" arch: "x86" Family: "unix"
    
****************************************************************************
SCM Changes:
****************************************************************************
No files changed

****************************************************************************
Dependencies Changes:
****************************************************************************
org.apache.myfaces.tobago:tobago-tool-apt:1.1.0-SNAPSHOT

org.apache.myfaces.tobago:tobago-tool-annotation:1.1.0-SNAPSHOT

org.apache.myfaces.tobago:tobago-extension:1.1.0-SNAPSHOT

****************************************************************************
Test Summary:
****************************************************************************
Tests: 0
Failures: 0
Total time: 0

****************************************************************************
Output:
****************************************************************************
[INFO] Scanning for projects...
[INFO] Searching repository for plugin with prefix: 'checkstyle'.
[INFO] ------------------------------------------------------------------------
[INFO] Building Tobago Facelets
[INFO]    task-segment: [clean, deploy, checkstyle:check]
[INFO] ------------------------------------------------------------------------
[INFO] [clean:clean]
[INFO] Deleting directory /local/continuum-1.1-beta-2/working-directory/27/target
[INFO] [scm:update {execution: getting-scm.revision}]
[INFO] Executing: svn --non-interactive update
[INFO] Working directory: /local/continuum-1.1-beta-2/working-directory/27
[INFO] Storing revision in 'scm.revision' project property.
[INFO] [dependency:unpack {execution: unpack-sources}]
[INFO] Configured Artifact: org.apache.myfaces.tobago:tobago-core:sources:1.1.0-SNAPSHOT:jar
[INFO] Unpacking /export/home/mrmaven/.m2/repository/org/apache/myfaces/tobago/tobago-core/1.1.0-SNAPSHOT/tobago-core-1.1.0-SNAPSHOT-sources.jarto
 /local/continuum-1.1-beta-2/working-directory/27/target/tobago-core-sources
with Includes null and excludes:null
[INFO] [apt:execute {execution: tobago-facelet-taglib}]
Note: /local/continuum-1.1-beta-2/working-directory/27/target/tobago-core-sources/org/apache/myfaces/tobago/config/TobagoConfig.java
uses or overrides a deprecated API.
Note: Recompile with -Xlint:deprecation for details.
[INFO] [resources:resources]
[INFO] Using default encoding to copy filtered resources.
[INFO] [compiler:compile]
[INFO] Compiling 33 source files to /local/continuum-1.1-beta-2/working-directory/27/target/classes
[INFO] [resources:testResources]
[INFO] Using default encoding to copy filtered resources.
[INFO] [compiler:testCompile]
[INFO] No sources to compile
[INFO] [surefire:test]
[INFO] No tests to run.
[INFO] [jar:jar]
[INFO] Building jar: /local/continuum-1.1-beta-2/working-directory/27/target/tobago-facelets-1.1.0-SNAPSHOT.jar
[INFO] Preparing javadoc:jar
[WARNING] Removing: jar from forked lifecycle, to prevent recursive invocation.
[INFO] [scm:update {execution: getting-scm.revision}]
[INFO] Executing: svn --non-interactive update
[INFO] Working directory: /local/continuum-1.1-beta-2/working-directory/27
[INFO] Storing revision in 'scm.revision' project property.
[INFO] [dependency:unpack {execution: unpack-sources}]
[INFO] Configured Artifact: org.apache.myfaces.tobago:tobago-core:sources:1.1.0-SNAPSHOT:jar
[INFO] tobago-core-1.1.0-SNAPSHOT-sources.jar already unpacked.
[INFO] [apt:execute {execution: tobago-facelet-taglib}]
Note: /local/continuum-1.1-beta-2/working-directory/27/target/tobago-core-sources/org/apache/myfaces/tobago/config/TobagoConfig.java
uses or overrides a deprecated API.
Note: Recompile with -Xlint:deprecation for details.
[INFO] [javadoc:jar {execution: attach-javadoc}]
[INFO] Building jar: /local/continuum-1.1-beta-2/working-directory/27/target/tobago-facelets-1.1.0-SNAPSHOT-javadoc.jar
[INFO] Preparing source:jar
[WARNING] Removing: jar from forked lifecycle, to prevent recursive invocation.
[WARNING] Removing: jar from forked lifecycle, to prevent recursive invocation.
[INFO] [scm:update {execution: getting-scm.revision}]
[INFO] Executing: svn --non-interactive update
[INFO] Working directory: /local/continuum-1.1-beta-2/working-directory/27
[INFO] Storing revision in 'scm.revision' project property.
[INFO] [dependency:unpack {execution: unpack-sources}]
[INFO] Configured Artifact: org.apache.myfaces.tobago:tobago-core:sources:1.1.0-SNAPSHOT:jar
[INFO] tobago-core-1.1.0-SNAPSHOT-sources.jar already unpacked.
[INFO] [apt:execute {execution: tobago-facelet-taglib}]
Note: /local/continuum-1.1-beta-2/working-directory/27/target/tobago-core-sources/org/apache/myfaces/tobago/config/TobagoConfig.java
uses or overrides a deprecated API.
Note: Recompile with -Xlint:deprecation for details.
[INFO] [source:jar {execution: attach-source}]
[INFO] Building jar: /local/continuum-1.1-beta-2/working-directory/27/target/tobago-facelets-1.1.0-SNAPSHOT-sources.jar
[INFO] [install:install]
[INFO] Installing /local/continuum-1.1-beta-2/working-directory/27/target/tobago-facelets-1.1.0-SNAPSHOT.jar
to /export/home/mrmaven/.m2/repository/org/apache/myfaces/tobago/tobago-facelets/1.1.0-SNAPSHOT/tobago-facelets-1.1.0-SNAPSHOT.jar
[INFO] Installing /local/continuum-1.1-beta-2/working-directory/27/target/tobago-facelets-1.1.0-SNAPSHOT-javadoc.jar
to /export/home/mrmaven/.m2/repository/org/apache/myfaces/tobago/tobago-facelets/1.1.0-SNAPSHOT/tobago-facelets-1.1.0-SNAPSHOT-javadoc.jar
[INFO] Installing /local/continuum-1.1-beta-2/working-directory/27/target/tobago-facelets-1.1.0-SNAPSHOT-sources.jar
to /export/home/mrmaven/.m2/repository/org/apache/myfaces/tobago/tobago-facelets/1.1.0-SNAPSHOT/tobago-facelets-1.1.0-SNAPSHOT-sources.jar
[INFO] [deploy:deploy]
altDeploymentRepository = null
[INFO] Retrieving previous build number from apache-maven-snapshots
Uploading: scpexe://minotaur.apache.org/www/people.apache.org/repo/m2-snapshot-repository/org/apache/myfaces/tobago/tobago-facelets/1.1.0-SNAPSHOT/tobago-facelets-1.1.0-SNAPSHOT.jar
[INFO] Retrieving previous metadata from apache-maven-snapshots
[INFO] Uploading repository metadata for: 'artifact org.apache.myfaces.tobago:tobago-facelets'
[INFO] Retrieving previous metadata from apache-maven-snapshots
[INFO] Uploading project information for tobago-facelets 1.1.0-SNAPSHOT
[INFO] Retrieving previous metadata from apache-maven-snapshots
[INFO] Uploading repository metadata for: 'snapshot org.apache.myfaces.tobago:tobago-facelets:1.1.0-SNAPSHOT'
[INFO] Retrieving previous build number from apache-maven-snapshots
Uploading: scpexe://minotaur.apache.org/www/people.apache.org/repo/m2-snapshot-repository/org/apache/myfaces/tobago/tobago-facelets/1.1.0-SNAPSHOT/tobago-facelets-1.1.0-SNAPSHOT-javadoc.jar
[INFO] Retrieving previous build number from apache-maven-snapshots
Uploading: scpexe://minotaur.apache.org/www/people.apache.org/repo/m2-snapshot-repository/org/apache/myfaces/tobago/tobago-facelets/1.1.0-SNAPSHOT/tobago-facelets-1.1.0-SNAPSHOT-sources.jar
[INFO] Preparing checkstyle:check
[INFO] Setting property: classpath.resource.loader.class => 'org.codehaus.plexus.velocity.ContextClassLoaderResourceLoader'.
[INFO] Setting property: velocimacro.messages.on => 'false'.
[INFO] Setting property: resource.loader => 'classpath'.
[INFO] Setting property: resource.manager.logwhenfound => 'false'.
[INFO] ************************************************************** 
[INFO] Starting Jakarta Velocity v1.4
[INFO] RuntimeInstance initializing.
[INFO] Default Properties File: org/apache/velocity/runtime/defaults/velocity.properties
[INFO] Default ResourceManager initializing. (class org.apache.velocity.runtime.resource.ResourceManagerImpl)
[INFO] Resource Loader Instantiated: org.codehaus.plexus.velocity.ContextClassLoaderResourceLoader
[INFO] ClasspathResourceLoader : initialization starting.
[INFO] ClasspathResourceLoader : initialization complete.
[INFO] ResourceCache : initialized. (class org.apache.velocity.runtime.resource.ResourceCacheImpl)
[INFO] Default ResourceManager initialization complete.
[INFO] Loaded System Directive: org.apache.velocity.runtime.directive.Literal
[INFO] Loaded System Directive: org.apache.velocity.runtime.directive.Macro
[INFO] Loaded System Directive: org.apache.velocity.runtime.directive.Parse
[INFO] Loaded System Directive: org.apache.velocity.runtime.directive.Include
[INFO] Loaded System Directive: org.apache.velocity.runtime.directive.Foreach
[INFO] Created: 20 parsers.
[INFO] Velocimacro : initialization starting.
[INFO] Velocimacro : adding VMs from VM library template : VM_global_library.vm
[ERROR] ResourceManager : unable to find resource 'VM_global_library.vm' in any resource loader.
[INFO] Velocimacro : error using  VM library template VM_global_library.vm : org.apache.velocity.exception.ResourceNotFoundException:
Unable to find resource 'VM_global_library.vm'
[INFO] Velocimacro :  VM library template macro registration complete.
[INFO] Velocimacro : allowInline = true : VMs can be defined inline in templates
[INFO] Velocimacro : allowInlineToOverride = false : VMs defined inline may NOT replace previous
VM definitions
[INFO] Velocimacro : allowInlineLocal = false : VMs defined inline will be  global in scope
if allowed.
[INFO] Velocimacro : initialization complete.
[INFO] Velocity successfully started.
[INFO] [checkstyle:checkstyle]
[INFO] There are 2 checkstyle errors.
[INFO] [checkstyle:check]
[INFO] ------------------------------------------------------------------------
[ERROR] BUILD FAILURE
[INFO] ------------------------------------------------------------------------
[INFO] You have 2 checkstyle violations.
[INFO] ------------------------------------------------------------------------
[INFO] For more information, run Maven with the -e switch
[INFO] ------------------------------------------------------------------------
[INFO] Total time: 1 minute 16 seconds
[INFO] Finished at: Thu Mar 13 14:47:29 GMT+00:00 2008
[INFO] Final Memory: 27M/92M
[INFO] ------------------------------------------------------------------------

****************************************************************************



Mime
View raw message