myfaces-commits mailing list archives

Site index · List index
Message view « Date » · « Thread »
Top « Date » · « Thread »
From "Continuum@myfaces.zones.apache.org" <comm...@myfaces.apache.org>
Subject [continuum] BUILD FAILURE: Tobago Sandbox
Date Fri, 14 Dec 2007 12:34:29 GMT
Online report : http://myfaces.zones.apache.org:8080/continuum/buildResult.action?buildId=4243&projectId=32

Build statistics:
  State: Failed
  Previous State: Failed
  Started at: Fri 14 Dec 2007 12:33:42 +0000
  Finished at: Fri 14 Dec 2007 12:34:21 +0000
  Total time: 38s
  Build Trigger: Schedule
  Build Number: 99
  Exit code: 1
  Building machine hostname: myfaces.zones.apache.org
  Operating system : SunOS(unknown)
  Java Home version : 
          java version "1.5.0_13"
          Java(TM) 2 Runtime Environment, Standard Edition (build 1.5.0_13-b05)
          Java HotSpot(TM) Server VM (build 1.5.0_13-b05, mixed mode)
        
  Builder version :
          Maven version: 2.0.7
          Java version: 1.5.0_13
          OS name: "sunos" version: "5.10" arch: "x86"
    
****************************************************************************
SCM Changes:
****************************************************************************
Changed: lofwyr @ Fri 14 Dec 2007 11:10:47 +0000
Comment: TOBAGO-518: some refactorings + cleanup
Files changed:
  /myfaces/tobago/trunk/sandbox/src/main/java/org/apache/myfaces/tobago/model/AbstractWizard.java
( 604163 )
  /myfaces/tobago/trunk/sandbox/src/main/java/org/apache/myfaces/tobago/model/Wizard.java
( 604163 )
  /myfaces/tobago/trunk/sandbox/src/main/java/org/apache/myfaces/tobago/model/WizardStep.java
( 604163 )
  /myfaces/tobago/trunk/sandbox/src/main/java/org/apache/myfaces/tobago/taglib/sandbox/WizardTag.java
( 604163 )
  /myfaces/tobago/trunk/sandbox/src/main/resources/META-INF/wizard-goto.xml ( 604163 )
  /myfaces/tobago/trunk/sandbox/src/main/resources/META-INF/wizard-navigation.xml ( 604163
)

****************************************************************************
Dependencies Changes:
****************************************************************************
org.apache.myfaces.tobago:tobago-core:1.0.14-SNAPSHOT

org.apache.myfaces.tobago:tobago-theme-standard:1.0.14-SNAPSHOT

org.apache.myfaces.tobago:tobago-facelets:1.0.14-SNAPSHOT

org.apache.myfaces.tobago:tobago-tool-apt:1.0.14-SNAPSHOT

org.apache.myfaces.tobago:tobago-tool-annotation:1.0.14-SNAPSHOT

org.apache.myfaces.tobago:tobago:1.0.14-SNAPSHOT

****************************************************************************
Test Summary:
****************************************************************************
Tests: 0
Failures: 0
Total time: 0

****************************************************************************
Output:
****************************************************************************
[INFO] Scanning for projects...
[INFO] Searching repository for plugin with prefix: 'checkstyle'.
[INFO] ----------------------------------------------------------------------------
[INFO] Building Tobago Sandbox
[INFO]    task-segment: [clean, deploy, checkstyle:check]
[INFO] ----------------------------------------------------------------------------
[INFO] [clean:clean]
[INFO] Deleting directory /local/continuum-1.1-beta-2/working-directory/32/target
[INFO] [cobertura:clean {execution: clean}]
[INFO] [scm:update {execution: getting-scm.revision}]
[INFO] Executing: svn --non-interactive update
[INFO] Working directory: /local/continuum-1.1-beta-2/working-directory/32
[INFO] Storing revision in 'scm.revision' project property.
[INFO] [dependency:unpack {execution: unpack-sources}]
[INFO] Configured Artifact: org.apache.myfaces.tobago:tobago-core:sources:1.0.14-SNAPSHOT:jar
[INFO] Expanding: /export/home/mrmaven/.m2/repository/org/apache/myfaces/tobago/tobago-core/1.0.14-SNAPSHOT/tobago-core-1.0.14-SNAPSHOT-sources.jar
into /local/continuum-1.1-beta-2/working-directory/32/target/tobago-core-sources
[INFO] [resources:resources]
[INFO] Using default encoding to copy filtered resources.
[INFO] [compiler:compile]
[INFO] Compiling 60 source files to /local/continuum-1.1-beta-2/working-directory/32/target/classes
[INFO] ------------------------------------------------------------------------
[ERROR] BUILD FAILURE
[INFO] ------------------------------------------------------------------------
[INFO] Compilation failure

/local/continuum-1.1-beta-2/working-directory/32/src/main/java/org/apache/myfaces/tobago/taglib/sandbox/WizardTag.java:[69,21]
cannot find symbol
symbol  : variable FACET_LAYOUT
location: class org.apache.myfaces.tobago.taglib.sandbox.WizardTag

/local/continuum-1.1-beta-2/working-directory/32/src/main/java/org/apache/myfaces/tobago/taglib/sandbox/WizardTag.java:[93,31]
cannot find symbol
symbol  : variable PropertyUtils
location: class org.apache.myfaces.tobago.taglib.sandbox.WizardTag

/local/continuum-1.1-beta-2/working-directory/32/src/main/java/org/apache/myfaces/tobago/taglib/sandbox/WizardTag.java:[107,21]
cannot find symbol
symbol  : variable FACET_LAYOUT
location: class org.apache.myfaces.tobago.taglib.sandbox.WizardTag

/local/continuum-1.1-beta-2/working-directory/32/src/main/java/org/apache/myfaces/tobago/taglib/sandbox/WizardTag.java:[164,21]
cannot find symbol
symbol  : variable FACET_LAYOUT
location: class org.apache.myfaces.tobago.taglib.sandbox.WizardTag


[INFO] ------------------------------------------------------------------------
[INFO] For more information, run Maven with the -e switch
[INFO] ------------------------------------------------------------------------
[INFO] Total time: 36 seconds
[INFO] Finished at: Fri Dec 14 12:34:20 GMT+00:00 2007
[INFO] Final Memory: 15M/72M
[INFO] ------------------------------------------------------------------------

****************************************************************************



Mime
View raw message