myfaces-commits mailing list archives

Site index · List index
Message view « Date » · « Thread »
Top « Date » · « Thread »
From "Continuum@myfaces.zones.apache.org" <comm...@myfaces.apache.org>
Subject [continuum] BUILD FAILURE: Tobago Sandbox
Date Thu, 01 Nov 2007 09:37:31 GMT
Online report : http://myfaces.zones.apache.org:8080/continuum/buildResult.action?buildId=1464&projectId=32

Build statistics:
  State: Failed
  Previous State: Failed
  Started at: Thu 1 Nov 2007 09:35:47 +0000
  Finished at: Thu 1 Nov 2007 09:37:29 +0000
  Total time: 1m 41s
  Build Trigger: Schedule
  Build Number: 33
  Exit code: 1
  Building machine hostname: myfaces.zones.apache.org
  Operating system : SunOS(unknown)
  Java Home version : 
          java version "1.5.0_13"
          Java(TM) 2 Runtime Environment, Standard Edition (build 1.5.0_13-b05)
          Java HotSpot(TM) Server VM (build 1.5.0_13-b05, mixed mode)
        
  Builder version :
          Maven version: 2.0.7
          Java version: 1.5.0_13
          OS name: "sunos" version: "5.10" arch: "x86"
    
****************************************************************************
SCM Changes:
****************************************************************************
No files changed

****************************************************************************
Dependencies Changes:
****************************************************************************
org.apache.myfaces.tobago:tobago-core:1.0.13-SNAPSHOT

org.apache.myfaces.tobago:tobago-theme-standard:1.0.13-SNAPSHOT

org.apache.myfaces.tobago:tobago-facelets:1.0.13-SNAPSHOT

org.apache.myfaces.tobago:tobago-tool-apt:1.0.13-SNAPSHOT

org.apache.myfaces.tobago:tobago-tool-annotation:1.0.13-SNAPSHOT

org.apache.myfaces.tobago:tobago:1.0.13-SNAPSHOT

****************************************************************************
Test Summary:
****************************************************************************
Tests: 8
Failures: 0
Total time: 220

****************************************************************************
Output:
****************************************************************************
[INFO] Scanning for projects...
[INFO] Searching repository for plugin with prefix: 'checkstyle'.
[INFO] ----------------------------------------------------------------------------
[INFO] Building Tobago Sandbox
[INFO]    task-segment: [clean, deploy, checkstyle:check]
[INFO] ----------------------------------------------------------------------------
[INFO] [clean:clean]
[INFO] Deleting directory /local/continuum-1.1-beta-2/apps/continuum/webapp/WEB-INF/working-directory/32/target
[INFO] Deleting directory /local/continuum-1.1-beta-2/apps/continuum/webapp/WEB-INF/working-directory/32/target/classes
[INFO] Deleting directory /local/continuum-1.1-beta-2/apps/continuum/webapp/WEB-INF/working-directory/32/target/test-classes
[INFO] Deleting directory /local/continuum-1.1-beta-2/apps/continuum/webapp/WEB-INF/working-directory/32/target/site
[INFO] [cobertura:clean {execution: clean}]
[INFO] [scm:update {execution: getting-scm.revision}]
[INFO] Executing: svn --non-interactive update
[INFO] Working directory: /local/continuum-1.1-beta-2/apps/continuum/webapp/WEB-INF/working-directory/32
[INFO] Storing revision in 'scm.revision' project property.
[INFO] [dependency:unpack {execution: unpack-sources}]
[INFO] Configured Artifact: org.apache.myfaces.tobago:tobago-core:sources:1.0.13-SNAPSHOT:jar
[INFO] Expanding: /export/home/mrmaven/.m2/repository/org/apache/myfaces/tobago/tobago-core/1.0.13-SNAPSHOT/tobago-core-1.0.13-SNAPSHOT-sources.jar
into /local/continuum-1.1-beta-2/apps/continuum/webapp/WEB-INF/working-directory/32/target/tobago-core-sources
[INFO] [resources:resources]
[INFO] Using default encoding to copy filtered resources.
[INFO] [compiler:compile]
[INFO] Compiling 56 source files to /local/continuum-1.1-beta-2/apps/continuum/webapp/WEB-INF/working-directory/32/target/classes
[INFO] [apt:execute {execution: tobago-tlds}]
Note: Some input files use or override a deprecated API.
Note: Recompile with -Xlint:deprecation for details.
[INFO] [apt:execute {execution: tobago-faces-config}]
[ERROR] Note: Some input files use or override a deprecated API.
Note: Recompile with -Xlint:deprecation for details.

[INFO] [resources:resources {execution: copy-faces-config}]
[INFO] Using default encoding to copy filtered resources.
[INFO] [resources:testResources]
[INFO] Using default encoding to copy filtered resources.
[INFO] [compiler:testCompile]
[INFO] Compiling 2 source files to /local/continuum-1.1-beta-2/apps/continuum/webapp/WEB-INF/working-directory/32/target/test-classes
[INFO] [surefire:test]
[INFO] Surefire report directory: /local/continuum-1.1-beta-2/apps/continuum/webapp/WEB-INF/working-directory/32/target/surefire-reports

-------------------------------------------------------
 T E S T S
-------------------------------------------------------
Running org.apache.myfaces.tobago.model.MixedTreeModelUnitTest
log4j:WARN No appenders could be found for logger (org.apache.myfaces.tobago.model.MixedTreeModel).
log4j:WARN Please initialize the log4j system properly.
Tests run: 4, Failures: 0, Errors: 0, Skipped: 0, Time elapsed: 0.223 sec
Running org.apache.myfaces.tobago.model.TreeModelUnitTest
Tests run: 4, Failures: 0, Errors: 0, Skipped: 0, Time elapsed: 0.023 sec

Results :

Tests run: 8, Failures: 0, Errors: 0, Skipped: 0

[INFO] [jar:jar]
[INFO] Building jar: /local/continuum-1.1-beta-2/apps/continuum/webapp/WEB-INF/working-directory/32/target/tobago-sandbox-1.0.13-SNAPSHOT.jar
[INFO] Preparing javadoc:jar
[INFO] ----------------------------------------------------------------------------
[INFO] Building Tobago Sandbox
[INFO] ----------------------------------------------------------------------------
[WARNING] Removing: jar from forked lifecycle, to prevent recursive invocation.
[INFO] [scm:update {execution: getting-scm.revision}]
[INFO] Executing: svn --non-interactive update
[INFO] Working directory: /local/continuum-1.1-beta-2/apps/continuum/webapp/WEB-INF/working-directory/32
[INFO] Storing revision in 'scm.revision' project property.
[INFO] [dependency:unpack {execution: unpack-sources}]
[INFO] Configured Artifact: org.apache.myfaces.tobago:tobago-core:sources:1.0.13-SNAPSHOT:jar
[INFO] tobago-core-1.0.13-SNAPSHOT-sources.jar already unpacked.
[INFO] [javadoc:jar {execution: attach-javadoc}]
[ERROR] Error fetching link: http://www.junit.org/junit/javadoc/package-list. IGNORED IT.
[INFO] Building jar: /local/continuum-1.1-beta-2/apps/continuum/webapp/WEB-INF/working-directory/32/target/tobago-sandbox-1.0.13-SNAPSHOT-javadoc.jar
[INFO] Preparing taglib:taglibdocjar
[INFO] Setting property: classpath.resource.loader.class => 'org.codehaus.plexus.velocity.ContextClassLoaderResourceLoader'.
[INFO] Setting property: velocimacro.messages.on => 'false'.
[INFO] Setting property: resource.loader => 'classpath'.
[INFO] Setting property: resource.manager.logwhenfound => 'false'.
[INFO] ************************************************************** 
[INFO] Starting Jakarta Velocity v1.4
[INFO] RuntimeInstance initializing.
[INFO] Default Properties File: org/apache/velocity/runtime/defaults/velocity.properties
[INFO] Default ResourceManager initializing. (class org.apache.velocity.runtime.resource.ResourceManagerImpl)
[INFO] Resource Loader Instantiated: org.codehaus.plexus.velocity.ContextClassLoaderResourceLoader
[INFO] ClasspathResourceLoader : initialization starting.
[INFO] ClasspathResourceLoader : initialization complete.
[INFO] ResourceCache : initialized. (class org.apache.velocity.runtime.resource.ResourceCacheImpl)
[INFO] Default ResourceManager initialization complete.
[INFO] Loaded System Directive: org.apache.velocity.runtime.directive.Literal
[INFO] Loaded System Directive: org.apache.velocity.runtime.directive.Macro
[INFO] Loaded System Directive: org.apache.velocity.runtime.directive.Parse
[INFO] Loaded System Directive: org.apache.velocity.runtime.directive.Include
[INFO] Loaded System Directive: org.apache.velocity.runtime.directive.Foreach
[INFO] Created: 20 parsers.
[INFO] Velocimacro : initialization starting.
[INFO] Velocimacro : adding VMs from VM library template : VM_global_library.vm
[ERROR] ResourceManager : unable to find resource 'VM_global_library.vm' in any resource loader.
[INFO] Velocimacro : error using  VM library template VM_global_library.vm : org.apache.velocity.exception.ResourceNotFoundException:
Unable to find resource 'VM_global_library.vm'
[INFO] Velocimacro :  VM library template macro registration complete.
[INFO] Velocimacro : allowInline = true : VMs can be defined inline in templates
[INFO] Velocimacro : allowInlineToOverride = false : VMs defined inline may NOT replace previous
VM definitions
[INFO] Velocimacro : allowInlineLocal = false : VMs defined inline will be  global in scope
if allowed.
[INFO] Velocimacro : initialization complete.
[INFO] Velocity successfully started.
[INFO] [taglib:taglibdoc]
[INFO] [taglib:taglibdocjar {execution: attach-tlddoc}]
[INFO] Building jar: /local/continuum-1.1-beta-2/apps/continuum/webapp/WEB-INF/working-directory/32/target/tobago-sandbox-1.0.13-SNAPSHOT-tlddoc.jar
[INFO] Preparing source:jar
[WARNING] Removing: jar from forked lifecycle, to prevent recursive invocation.
[WARNING] Removing: taglibdocjar from forked lifecycle, to prevent recursive invocation.
[WARNING] Removing: jar from forked lifecycle, to prevent recursive invocation.
[INFO] [scm:update {execution: getting-scm.revision}]
[INFO] Executing: svn --non-interactive update
[INFO] Working directory: /local/continuum-1.1-beta-2/apps/continuum/webapp/WEB-INF/working-directory/32
[INFO] Storing revision in 'scm.revision' project property.
[INFO] [dependency:unpack {execution: unpack-sources}]
[INFO] Configured Artifact: org.apache.myfaces.tobago:tobago-core:sources:1.0.13-SNAPSHOT:jar
[INFO] tobago-core-1.0.13-SNAPSHOT-sources.jar already unpacked.
[INFO] [source:jar {execution: attach-source}]
[INFO] Building jar: /local/continuum-1.1-beta-2/apps/continuum/webapp/WEB-INF/working-directory/32/target/tobago-sandbox-1.0.13-SNAPSHOT-sources.jar
[INFO] [retrotranslator:translate-project {execution: default}]
[INFO] Transforming 78 file(s) from /local/continuum-1.1-beta-2/apps/continuum/webapp/WEB-INF/working-directory/32/target/tobago-sandbox-1.0.13-SNAPSHOT.jar
to /local/continuum-1.1-beta-2/apps/continuum/webapp/WEB-INF/working-directory/32/target/tobago-sandbox-1.0.13-SNAPSHOT-jdk14retro.jar.
[INFO] Transformation of 78 file(s) completed successfully.
[INFO] Verifying 78 file(s) in /local/continuum-1.1-beta-2/apps/continuum/webapp/WEB-INF/working-directory/32/target/tobago-sandbox-1.0.13-SNAPSHOT-jdk14retro.jar.
[INFO] Verification of 78 file(s) completed successfully.
[INFO] [install:install]
[INFO] Installing /local/continuum-1.1-beta-2/apps/continuum/webapp/WEB-INF/working-directory/32/target/tobago-sandbox-1.0.13-SNAPSHOT.jar
to /export/home/mrmaven/.m2/repository/org/apache/myfaces/tobago/tobago-sandbox/1.0.13-SNAPSHOT/tobago-sandbox-1.0.13-SNAPSHOT.jar
[INFO] Installing /local/continuum-1.1-beta-2/apps/continuum/webapp/WEB-INF/working-directory/32/target/tobago-sandbox-1.0.13-SNAPSHOT-javadoc.jar
to /export/home/mrmaven/.m2/repository/org/apache/myfaces/tobago/tobago-sandbox/1.0.13-SNAPSHOT/tobago-sandbox-1.0.13-SNAPSHOT-javadoc.jar
[INFO] Installing /local/continuum-1.1-beta-2/apps/continuum/webapp/WEB-INF/working-directory/32/target/tobago-sandbox-1.0.13-SNAPSHOT-tlddoc.jar
to /export/home/mrmaven/.m2/repository/org/apache/myfaces/tobago/tobago-sandbox/1.0.13-SNAPSHOT/tobago-sandbox-1.0.13-SNAPSHOT-tlddoc.jar
[INFO] Installing /local/continuum-1.1-beta-2/apps/continuum/webapp/WEB-INF/working-directory/32/target/tobago-sandbox-1.0.13-SNAPSHOT-sources.jar
to /export/home/mrmaven/.m2/repository/org/apache/myfaces/tobago/tobago-sandbox/1.0.13-SNAPSHOT/tobago-sandbox-1.0.13-SNAPSHOT-sources.jar
[INFO] Installing /local/continuum-1.1-beta-2/apps/continuum/webapp/WEB-INF/working-directory/32/target/tobago-sandbox-1.0.13-SNAPSHOT-jdk14retro.jar
to /export/home/mrmaven/.m2/repository/org/apache/myfaces/tobago/tobago-sandbox/1.0.13-SNAPSHOT/tobago-sandbox-1.0.13-SNAPSHOT-jdk14retro.jar
[INFO] [deploy:deploy]
altDeploymentRepository = null
[INFO] Retrieving previous build number from apache-maven-snapshots
Uploading: scpexe://minotaur.apache.org/www/people.apache.org/repo/m2-snapshot-repository/org/apache/myfaces/tobago/tobago-sandbox/1.0.13-SNAPSHOT/tobago-sandbox-1.0.13-SNAPSHOT.jar
[INFO] Retrieving previous metadata from apache-maven-snapshots
[INFO] Uploading project information for tobago-sandbox 1.0.13-SNAPSHOT
[INFO] Retrieving previous metadata from apache-maven-snapshots
[INFO] Uploading repository metadata for: 'artifact org.apache.myfaces.tobago:tobago-sandbox'
[INFO] Retrieving previous metadata from apache-maven-snapshots
[INFO] Uploading repository metadata for: 'snapshot org.apache.myfaces.tobago:tobago-sandbox:1.0.13-SNAPSHOT'
[INFO] Retrieving previous build number from apache-maven-snapshots
Uploading: scpexe://minotaur.apache.org/www/people.apache.org/repo/m2-snapshot-repository/org/apache/myfaces/tobago/tobago-sandbox/1.0.13-SNAPSHOT/tobago-sandbox-1.0.13-SNAPSHOT-javadoc.jar
[INFO] Retrieving previous build number from apache-maven-snapshots
Uploading: scpexe://minotaur.apache.org/www/people.apache.org/repo/m2-snapshot-repository/org/apache/myfaces/tobago/tobago-sandbox/1.0.13-SNAPSHOT/tobago-sandbox-1.0.13-SNAPSHOT-tlddoc.jar
[INFO] Retrieving previous build number from apache-maven-snapshots
Uploading: scpexe://minotaur.apache.org/www/people.apache.org/repo/m2-snapshot-repository/org/apache/myfaces/tobago/tobago-sandbox/1.0.13-SNAPSHOT/tobago-sandbox-1.0.13-SNAPSHOT-sources.jar
[INFO] Retrieving previous build number from apache-maven-snapshots
Uploading: scpexe://minotaur.apache.org/www/people.apache.org/repo/m2-snapshot-repository/org/apache/myfaces/tobago/tobago-sandbox/1.0.13-SNAPSHOT/tobago-sandbox-1.0.13-SNAPSHOT-jdk14retro.jar
[INFO] Preparing checkstyle:check
[INFO] Setting property: classpath.resource.loader.class => 'org.codehaus.plexus.velocity.ContextClassLoaderResourceLoader'.
[INFO] Setting property: velocimacro.messages.on => 'false'.
[INFO] Setting property: resource.loader => 'classpath'.
[INFO] Setting property: resource.manager.logwhenfound => 'false'.
[INFO] ************************************************************** 
[INFO] Starting Jakarta Velocity v1.4
[INFO] RuntimeInstance initializing.
[INFO] Default Properties File: org/apache/velocity/runtime/defaults/velocity.properties
[INFO] Default ResourceManager initializing. (class org.apache.velocity.runtime.resource.ResourceManagerImpl)
[INFO] Resource Loader Instantiated: org.codehaus.plexus.velocity.ContextClassLoaderResourceLoader
[INFO] ClasspathResourceLoader : initialization starting.
[INFO] ClasspathResourceLoader : initialization complete.
[INFO] ResourceCache : initialized. (class org.apache.velocity.runtime.resource.ResourceCacheImpl)
[INFO] Default ResourceManager initialization complete.
[INFO] Loaded System Directive: org.apache.velocity.runtime.directive.Literal
[INFO] Loaded System Directive: org.apache.velocity.runtime.directive.Macro
[INFO] Loaded System Directive: org.apache.velocity.runtime.directive.Parse
[INFO] Loaded System Directive: org.apache.velocity.runtime.directive.Include
[INFO] Loaded System Directive: org.apache.velocity.runtime.directive.Foreach
[INFO] Created: 20 parsers.
[INFO] Velocimacro : initialization starting.
[INFO] Velocimacro : adding VMs from VM library template : VM_global_library.vm
[ERROR] ResourceManager : unable to find resource 'VM_global_library.vm' in any resource loader.
[INFO] Velocimacro : error using  VM library template VM_global_library.vm : org.apache.velocity.exception.ResourceNotFoundException:
Unable to find resource 'VM_global_library.vm'
[INFO] Velocimacro :  VM library template macro registration complete.
[INFO] Velocimacro : allowInline = true : VMs can be defined inline in templates
[INFO] Velocimacro : allowInlineToOverride = false : VMs defined inline may NOT replace previous
VM definitions
[INFO] Velocimacro : allowInlineLocal = false : VMs defined inline will be  global in scope
if allowed.
[INFO] Velocimacro : initialization complete.
[INFO] Velocity successfully started.
[INFO] [checkstyle:checkstyle]
[INFO] There are 2 checkstyle errors.
[INFO] [checkstyle:check]
[INFO] ------------------------------------------------------------------------
[ERROR] BUILD FAILURE
[INFO] ------------------------------------------------------------------------
[INFO] You have 2 checkstyle violations.
[INFO] ------------------------------------------------------------------------
[INFO] For more information, run Maven with the -e switch
[INFO] ------------------------------------------------------------------------
[INFO] Total time: 1 minute 39 seconds
[INFO] Finished at: Thu Nov 01 09:37:28 GMT+00:00 2007
[INFO] Final Memory: 28M/86M
[INFO] ------------------------------------------------------------------------

****************************************************************************



Mime
View raw message