myfaces-commits mailing list archives

Site index · List index
Message view « Date » · « Thread »
Top « Date » · « Thread »
From "Continuum@myfaces.zones.apache.org" <comm...@myfaces.apache.org>
Subject [continuum] BUILD FAILURE: API
Date Mon, 09 Apr 2007 09:25:03 GMT
Online report : http://myfaces.zones.apache.org:8081/continuum/buildResult.action?buildId=6808&projectId=67
Build statistics:
  State: Failed
  Previous State: Ok
  Started at: Mon, 9 Apr 2007 09:23:32 +0000
  Finished at: Mon, 9 Apr 2007 09:24:54 +0000
  Total time: 1m 22s
  Build Trigger: Schedule
  Build Number: 118
  Exit code: 1
  Building machine hostname: myfaces.zones.apache.org
  Operating system : SunOS(unknown)
  Java version : 1.5.0_11(Sun Microsystems Inc.)

****************************************************************************
SCM Changes:
****************************************************************************
Changed: mbr @ Mon, 9 Apr 2007 08:56:45 +0000
Comment: fix NPE if locale is null
Files changed:
  /myfaces/core/branches/jsf12/api/src/main/java/javax/faces/validator/_MessageUtils.java
( 526676 )
  /myfaces/core/branches/jsf12/api/src/test/java/javax/faces/Messages.properties ( 526676
)
  /myfaces/core/branches/jsf12/api/src/test/java/javax/faces/validator ( 526676 )
  /myfaces/core/branches/jsf12/api/src/test/java/javax/faces/validator/_MessageUtilsTest.java
( 526676 )

****************************************************************************
SCM Changes since last success:
****************************************************************************
****************************************************************************
Dependencies Changes:
****************************************************************************
org.apache.myfaces.core:myfaces-build:1.2.0-SNAPSHOT

org.apache.myfaces.core:myfaces-core-project:1.2.0-SNAPSHOT

****************************************************************************
Test Summary:
****************************************************************************
Tests: 226
Failures: 1
Total time: 13387

****************************************************************************
Output:
****************************************************************************
[INFO] Scanning for projects...
[INFO] Searching repository for plugin with prefix: 'source'.
[INFO] ----------------------------------------------------------------------------
[INFO] Building API
[INFO]    task-segment: [clean, deploy, source:jar]
[INFO] ----------------------------------------------------------------------------
[INFO] [clean:clean]
[INFO] Deleting directory /local/continuum-1.1-SNAPSHOT/apps/continuum/working-directory/67/target
[INFO] Deleting directory /local/continuum-1.1-SNAPSHOT/apps/continuum/working-directory/67/target/classes
[INFO] Deleting directory /local/continuum-1.1-SNAPSHOT/apps/continuum/working-directory/67/target/test-classes
[INFO] [cobertura:clean {execution: default}]
[INFO] [faces:generate-components {execution: default}]
[WARNING] Missing <component-family> for "javax.faces.component.UIColumn", generation
of this Component is skipped
[WARNING] Missing <component-family> for "javax.faces.component.UIComponent", generation
of this Component is skipped
[WARNING] Missing <component-family> for "javax.faces.component.UIComponentBase", generation
of this Component is skipped
[WARNING] Missing <component-family> for "javax.faces.component.UIForm", generation
of this Component is skipped
[INFO] Generated 45 component(s)
[INFO] [resources:resources]
[INFO] Using default encoding to copy filtered resources.
[INFO] [compiler:compile]
Compiling 161 source files to /local/continuum-1.1-SNAPSHOT/apps/continuum/working-directory/67/target/classes
[INFO] [resources:testResources]
[INFO] Using default encoding to copy filtered resources.
[INFO] [compiler:testCompile]
Compiling 44 source files to /local/continuum-1.1-SNAPSHOT/apps/continuum/working-directory/67/target/test-classes
[INFO] [surefire:test]
[INFO] Surefire report directory: /local/continuum-1.1-SNAPSHOT/apps/continuum/working-directory/67/target/surefire-reports

-------------------------------------------------------
 T E S T S
-------------------------------------------------------
Running javax.faces.application.StateManagerTest
Tests run: 5, Failures: 0, Errors: 0, Skipped: 0, Time elapsed: 0.74 sec
Running javax.faces.application.ApplicationTest
Tests run: 9, Failures: 0, Errors: 0, Skipped: 0, Time elapsed: 0.113 sec
Running javax.faces.component.UIComponentBaseProcessSaveRestoreStateTest
Tests run: 4, Failures: 0, Errors: 0, Skipped: 0, Time elapsed: 1.485 sec
Running javax.faces.component.InvokeOnComponentTest
Apr 9, 2007 9:24:42 AM javax.faces.component.UIComponentBase getClientId
WARNING: WARNING: Component j_id0 just got an automatic id, because there was no id assigned
yet. If this component was created dynamically (i.e. not by a JSP tag) you should assign it
an explicit static id or assign it the id you get from the createUniqueId from the current
UIViewRoot component right after creation! Path to Component: {Component-Path : [Class: javax.faces.component.UIViewRoot,ViewId:
/viewId]}
RC; 2
No Renderer found for component {Component-Path : [Class: javax.faces.component.UIViewRoot,ViewId:
/viewId][Class: javax.faces.component.UIData,Id: table]} (component-family=javax.faces.Data,
renderer-type=javax.faces.Table)
Apr 9, 2007 9:24:42 AM javax.faces.component.UIComponentBase getRenderer
WARNING: No Renderer found for component {Component-Path : [Class: javax.faces.component.UIViewRoot,ViewId:
/viewId][Class: javax.faces.component.UIData,Id: table]} (component-family=javax.faces.Data,
renderer-type=javax.faces.Table)
RC; 2
No Renderer found for component {Component-Path : [Class: javax.faces.component.UIViewRoot,ViewId:
/viewId][Class: javax.faces.component.UIData,Id: table]} (component-family=javax.faces.Data,
renderer-type=javax.faces.Table)
No Renderer found for component {Component-Path : [Class: javax.faces.component.UIViewRoot,ViewId:
/viewId][Class: javax.faces.component.UIData,Id: table][Class: javax.faces.component.UIColumn,Id:
col2][Class: javax.faces.component.UIOutput,Id: j_id1]} (component-family=javax.faces.Output,
renderer-type=javax.faces.Text)
Tests run: 1, Failures: 0, Errors: 0, Skipped: 0, Time elapsed: 0.243 sec
Running javax.faces.component.UIViewRootTest
Apr 9, 2007 9:24:42 AM javax.faces.component.UIComponentBase getRenderer
WARNING: No Renderer found for component {Component-Path : [Class: javax.faces.component.UIViewRoot,ViewId:
/viewId][Class: javax.faces.component.UIData,Id: table]} (component-family=javax.faces.Data,
renderer-type=javax.faces.Table)
Apr 9, 2007 9:24:42 AM javax.faces.component.UIComponentBase getRenderer
WARNING: No Renderer found for component {Component-Path : [Class: javax.faces.component.UIViewRoot,ViewId:
/viewId][Class: javax.faces.component.UIData,Id: table][Class: javax.faces.component.UIColumn,Id:
col2][Class: javax.faces.component.UIOutput,Id: j_id1]} (component-family=javax.faces.Output,
renderer-type=javax.faces.Text)
Apr 9, 2007 9:24:42 AM javax.faces.component.UIComponentBase getClientId
WARNING: WARNING: Component table:j_id1 just got an automatic id, because there was no id
assigned yet. If this component was created dynamically (i.e. not by a JSP tag) you should
assign it an explicit static id or assign it the id you get from the createUniqueId from the
current UIViewRoot component right after creation! Path to Component: {Component-Path : [Class:
javax.faces.component.UIViewRoot,ViewId: /viewId][Class: javax.faces.component.UIData,Id:
table][Class: javax.faces.component.UIColumn,Id: col2][Class: javax.faces.component.UIOutput,Id:
j_id1]}
Tests run: 12, Failures: 0, Errors: 0, Skipped: 0, Time elapsed: 2.47 sec
Running javax.faces.convert.DateTimeConverterTest
Tests run: 1, Failures: 0, Errors: 0, Skipped: 0, Time elapsed: 0.033 sec
Running javax.faces.component.UIComponentTest
Tests run: 2, Failures: 0, Errors: 0, Skipped: 0, Time elapsed: 0.114 sec
Running javax.faces.application.ViewHandlerTest
Tests run: 6, Failures: 0, Errors: 0, Skipped: 0, Time elapsed: 0.369 sec
Apr 9, 2007 9:24:45 AM javax.faces.component.UIComponentBase getRenderer
Running javax.faces.component.UIInputTest
No Renderer found for component {Component-Path : [Class: javax.faces.component.UIInput,Id:
testId]} (component-family=javax.faces.Input, renderer-type=javax.faces.Text)
No Renderer found for component {Component-Path : [Class: javax.faces.component.UIInput,Id:
testId]} (component-family=javax.faces.Input, renderer-type=javax.faces.Text)
No Renderer found for component {Component-Path : [Class: javax.faces.component.UIInput,Id:
testId]} (component-family=javax.faces.Input, renderer-type=javax.faces.Text)
Tests run: 3, Failures: 0, Errors: 0, Skipped: 0, Time elapsed: 0.027 sec
Running javax.faces.component._ValueExpressionToValueBindingTest
WARNING: No Renderer found for component {Component-Path : [Class: javax.faces.component.UIInput,Id:
testId]} (component-family=javax.faces.Input, renderer-type=javax.faces.Text)
Apr 9, 2007 9:24:45 AM javax.faces.component.UIComponentBase getRenderer
WARNING: No Renderer found for component {Component-Path : [Class: javax.faces.component.UIInput,Id:
testId]} (component-family=javax.faces.Input, renderer-type=javax.faces.Text)
Apr 9, 2007 9:24:45 AM javax.faces.component.UIComponentBase getRenderer
WARNING: No Renderer found for component {Component-Path : [Class: javax.faces.component.UIInput,Id:
testId]} (component-family=javax.faces.Input, renderer-type=javax.faces.Text)
Tests run: 12, Failures: 0, Errors: 0, Skipped: 0, Time elapsed: 0.718 sec
Running javax.faces.component._MethodBindingToMethodExpressionTest
Tests run: 7, Failures: 0, Errors: 0, Skipped: 0, Time elapsed: 0.502 sec
Running javax.faces.application.FacesMessageTest
Tests run: 12, Failures: 0, Errors: 0, Skipped: 0, Time elapsed: 0.033 sec
Running javax.faces.component._ValueBindingToValueExpressionTest
Tests run: 13, Failures: 0, Errors: 0, Skipped: 0, Time elapsed: 0.716 sec
Running javax.faces.component.UIComponentBaseValueBindingTest
Tests run: 5, Failures: 0, Errors: 0, Skipped: 0, Time elapsed: 0.343 sec
Running javax.faces.convert.MessageUtilsTest
No Renderer found for component {Component-Path : [Class: javax.faces.component.html.HtmlInputText,Id:
testId]} (component-family=javax.faces.Input, renderer-type=javax.faces.Text)
Apr 9, 2007 9:24:48 AM javax.faces.component.UIComponentBase getRenderer
WARNING: No Renderer found for component {Component-Path : [Class: javax.faces.component.html.HtmlInputText,Id:
testId]} (component-family=javax.faces.Input, renderer-type=javax.faces.Text)
Tests run: 3, Failures: 0, Errors: 0, Skipped: 0, Time elapsed: 0.041 sec
Running javax.faces.FactoryFinderTest
Tests run: 9, Failures: 0, Errors: 0, Skipped: 0, Time elapsed: 0.014 sec
Running javax.faces.FacesExceptionTest
Tests run: 5, Failures: 0, Errors: 0, Skipped: 0, Time elapsed: 0.01 sec
Running javax.faces.component._AttachedStateWrapperTest
Tests run: 4, Failures: 0, Errors: 0, Skipped: 0, Time elapsed: 0.026 sec
Running javax.faces.component.UIComponentBaseFacesListenerTest
Tests run: 6, Failures: 0, Errors: 0, Skipped: 0, Time elapsed: 0.313 sec
Running javax.faces.component.UIComponentEncodeAllTest
Tests run: 4, Failures: 0, Errors: 0, Skipped: 0, Time elapsed: 0.241 sec
Running javax.faces.component.UIDataTest
Apr 9, 2007 9:24:49 AM javax.faces.component.UIComponentBase getRenderer
WARNING: No Renderer found for component {Component-Path : [Class: javax.faces.component.UIData,Id:
xxx]} (component-family=javax.faces.Data, renderer-type=javax.faces.Table)
No Renderer found for component {Component-Path : [Class: javax.faces.component.UIData,Id:
xxx]} (component-family=javax.faces.Data, renderer-type=javax.faces.Table)
Tests run: 33, Failures: 0, Errors: 0, Skipped: 0, Time elapsed: 0.083 sec
Running javax.faces.component.UIComponentBaseGetClientIdTest
Apr 9, 2007 9:24:49 AM javax.faces.component.UIComponentBase getClientId
WARNING: WARNING: Component uniqueId just got an automatic id, because there was no id assigned
yet. If this component was created dynamically (i.e. not by a JSP tag) you should assign it
an explicit static id or assign it the id you get from the createUniqueId from the current
UIViewRoot component right after creation! Path to Component: {Component-Path : [Class: $javax.faces.component.UIComponentBase$$EnhancerByCGLIB$$5a9ff482_18,Id:
uniqueId]}
Tests run: 7, Failures: 0, Errors: 0, Skipped: 0, Time elapsed: 0.558 sec
Running javax.faces.component.UIComponentValueExpressionTest
Tests run: 7, Failures: 0, Errors: 0, Skipped: 0, Time elapsed: 0.466 sec
Running javax.faces.component.UIComponentInvokeOnComponentTest
Tests run: 5, Failures: 0, Errors: 0, Skipped: 0, Time elapsed: 0.253 sec
Running javax.faces.component.UIComponentBaseTest
Tests run: 34, Failures: 0, Errors: 0, Skipped: 0, Time elapsed: 2.632 sec
Running javax.faces.component.UISelectManyTest
resource bundle javax.faces.Messages could not be found
No message with id javax.faces.component.UIInput.REQUIRED found in any bundle
resource bundle javax.faces.Messages could not be found
No message with id javax.faces.component.UIInput.REQUIRED found in any bundle
Tests run: 5, Failures: 0, Errors: 0, Skipped: 0, Time elapsed: 0.03 sec
Running javax.faces.component.UIComponentFindComponentTest
Tests run: 5, Failures: 0, Errors: 0, Skipped: 0, Time elapsed: 0.545 sec
Running javax.faces.component.html.HtmlOutputLinkTest
Tests run: 1, Failures: 0, Errors: 0, Skipped: 0, Time elapsed: 0.006 sec
Running javax.faces.component.UIGraphicTest
Tests run: 3, Failures: 0, Errors: 0, Skipped: 0, Time elapsed: 0.042 sec
Running javax.faces.component._AttachedListStateWrapperTest
Tests run: 2, Failures: 0, Errors: 0, Skipped: 0, Time elapsed: 0.008 sec
Running javax.faces.validator._MessageUtilsTest
Tests run: 1, Failures: 1, Errors: 0, Skipped: 0, Time elapsed: 0.032 sec <<< FAILURE!

Results :

Failed tests: 
  testErrorMessage(javax.faces.validator._MessageUtilsTest)

Tests run: 226, Failures: 1, Errors: 0, Skipped: 0

[INFO] ------------------------------------------------------------------------
[ERROR] BUILD FAILURE
[INFO] ------------------------------------------------------------------------
[INFO] There are test failures.
[INFO] ------------------------------------------------------------------------
[INFO] For more information, run Maven with the -e switch
[INFO] ------------------------------------------------------------------------
[INFO] Total time: 1 minute 20 seconds
[INFO] Finished at: Mon Apr 09 09:24:54 GMT+00:00 2007
[INFO] Final Memory: 10M/72M
[INFO] ------------------------------------------------------------------------

****************************************************************************



Mime
View raw message