myfaces-commits mailing list archives

Site index · List index
Message view « Date » · « Thread »
Top « Date » · « Thread »
From "Continuum@myfaces.zones.apache.org" <mrma...@myfaces.zones.apache.org>
Subject [continuum] BUILD FAILURE: Example Demo
Date Fri, 06 Apr 2007 21:49:18 GMT
Online report : http://myfaces.zones.apache.org:8080/continuum/servlet/continuum/target/ProjectBuild.vm/view/ProjectBuild/id/46/buildId/9801
Build statistics:
  State: Failed
  Previous State: Ok
  Started at: Fri, 6 Apr 2007 21:48:20 +0000
  Finished at: Fri, 6 Apr 2007 21:49:18 +0000
  Total time: 58s
  Build Trigger: Schedule
  Exit code: 1
  Building machine hostname: myfaces.zones.apache.org
  Operating system : SunOS(unknown)
  Java version : 1.5.0_11(Sun Microsystems Inc.)

Changes
         weber          example for popup inside sheet
             /myfaces/tobago/trunk/example/demo/src/main/java/org/apache/myfaces/tobago/example/reference/PopupReferenceController.java
            /myfaces/tobago/trunk/example/demo/src/main/webapp/WEB-INF/faces-config.xml
            /myfaces/tobago/trunk/example/demo/src/main/webapp/reference/popupSheet.jsp
        
****************************************************************************
Output:
****************************************************************************
[INFO] Scanning for projects...
[INFO] Searching repository for plugin with prefix: 'checkstyle'.
[INFO] ----------------------------------------------------------------------------
[INFO] Building Example Demo
[INFO]    task-segment: [clean, install, deploy, checkstyle:check]
[INFO] ----------------------------------------------------------------------------
[INFO] [clean:clean]
[INFO] Deleting directory /local/continuum-1.0.3-SNAPSHOT/apps/continuum/working-directory/46/target
[INFO] Deleting directory /local/continuum-1.0.3-SNAPSHOT/apps/continuum/working-directory/46/target/classes
[INFO] Deleting directory /local/continuum-1.0.3-SNAPSHOT/apps/continuum/working-directory/46/target/test-classes
[INFO] [cobertura:clean {execution: clean}]
[INFO] [resources:resources]
[INFO] Using default encoding to copy filtered resources.
[INFO] [theme:resources {execution: default}]
[INFO] Expanding: /export/home/mrmaven/.m2/repository/org/apache/myfaces/tobago/tobago-theme-charlotteville/1.0.11-SNAPSHOT/tobago-theme-charlotteville-1.0.11-SNAPSHOT.jar
into /local/continuum-1.0.3-SNAPSHOT/apps/continuum/working-directory/46/target/theme/work/tobago-theme-charlotteville-1.0.11-SNAPSHOT
[INFO] Expanding: /export/home/mrmaven/.m2/repository/org/apache/myfaces/tobago/tobago-theme-standard/1.0.11-SNAPSHOT/tobago-theme-standard-1.0.11-SNAPSHOT.jar
into /local/continuum-1.0.3-SNAPSHOT/apps/continuum/working-directory/46/target/theme/work/tobago-theme-standard-1.0.11-SNAPSHOT
[INFO] Expanding: /export/home/mrmaven/.m2/repository/org/apache/myfaces/tobago/tobago-theme-speyside/1.0.11-SNAPSHOT/tobago-theme-speyside-1.0.11-SNAPSHOT.jar
into /local/continuum-1.0.3-SNAPSHOT/apps/continuum/working-directory/46/target/theme/work/tobago-theme-speyside-1.0.11-SNAPSHOT
[INFO] Expanding: /export/home/mrmaven/.m2/repository/org/apache/myfaces/tobago/tobago-theme-richmond/1.0.11-SNAPSHOT/tobago-theme-richmond-1.0.11-SNAPSHOT.jar
into /local/continuum-1.0.3-SNAPSHOT/apps/continuum/working-directory/46/target/theme/work/tobago-theme-richmond-1.0.11-SNAPSHOT
[INFO] Expanding: /export/home/mrmaven/.m2/repository/org/apache/myfaces/tobago/tobago-theme-scarborough/1.0.11-SNAPSHOT/tobago-theme-scarborough-1.0.11-SNAPSHOT.jar
into /local/continuum-1.0.3-SNAPSHOT/apps/continuum/working-directory/46/target/theme/work/tobago-theme-scarborough-1.0.11-SNAPSHOT
[INFO] [compiler:compile]
[INFO] Compiling 34 source files to /local/continuum-1.0.3-SNAPSHOT/apps/continuum/working-directory/46/target/classes
[INFO] [resources:testResources]
[INFO] Using default encoding to copy filtered resources.
[INFO] [compiler:testCompile]
[INFO] No sources to compile
[INFO] [surefire:test]
[INFO] No tests to run.
[INFO] [war:war]
[INFO] Exploding webapp...
[INFO] Assembling webapp tobago-example-demo in /local/continuum-1.0.3-SNAPSHOT/apps/continuum/working-directory/46/target/tobago-example-demo
[INFO] Copy webapp webResources to /local/continuum-1.0.3-SNAPSHOT/apps/continuum/working-directory/46/target/tobago-example-demo
[INFO] Copy webapp webResources to /local/continuum-1.0.3-SNAPSHOT/apps/continuum/working-directory/46/target/tobago-example-demo
[INFO] Generating war /local/continuum-1.0.3-SNAPSHOT/apps/continuum/working-directory/46/target/tobago-example-demo.war
[INFO] Building war: /local/continuum-1.0.3-SNAPSHOT/apps/continuum/working-directory/46/target/tobago-example-demo.war
[INFO] [install:install]
[INFO] Installing /local/continuum-1.0.3-SNAPSHOT/apps/continuum/working-directory/46/target/tobago-example-demo.war
to /export/home/mrmaven/.m2/repository/org/apache/myfaces/tobago/tobago-example-demo/1.0.11-SNAPSHOT/tobago-example-demo-1.0.11-SNAPSHOT.war
[INFO] [resources:resources]
[INFO] Using default encoding to copy filtered resources.
[INFO] [theme:resources {execution: default}]
[INFO] [compiler:compile]
[INFO] Nothing to compile - all classes are up to date
[INFO] [resources:testResources]
[INFO] Using default encoding to copy filtered resources.
[INFO] [compiler:testCompile]
[INFO] No sources to compile
[INFO] [surefire:test]
[INFO] No tests to run.
[INFO] [war:war]
[INFO] Exploding webapp...
[INFO] Assembling webapp tobago-example-demo in /local/continuum-1.0.3-SNAPSHOT/apps/continuum/working-directory/46/target/tobago-example-demo
[INFO] Copy webapp webResources to /local/continuum-1.0.3-SNAPSHOT/apps/continuum/working-directory/46/target/tobago-example-demo
[INFO] Copy webapp webResources to /local/continuum-1.0.3-SNAPSHOT/apps/continuum/working-directory/46/target/tobago-example-demo
[INFO] Generating war /local/continuum-1.0.3-SNAPSHOT/apps/continuum/working-directory/46/target/tobago-example-demo.war
[INFO] Building war: /local/continuum-1.0.3-SNAPSHOT/apps/continuum/working-directory/46/target/tobago-example-demo.war
[INFO] [install:install]
[INFO] Installing /local/continuum-1.0.3-SNAPSHOT/apps/continuum/working-directory/46/target/tobago-example-demo.war
to /export/home/mrmaven/.m2/repository/org/apache/myfaces/tobago/tobago-example-demo/1.0.11-SNAPSHOT/tobago-example-demo-1.0.11-SNAPSHOT.war
[INFO] [deploy:deploy]
altDeploymentRepository = null
[INFO] Retrieving previous build number from apache-maven-snapshots
Uploading: scpexe://minotaur.apache.org/www/people.apache.org/repo/m2-snapshot-repository/org/apache/myfaces/tobago/tobago-example-demo/1.0.11-SNAPSHOT/tobago-example-demo-1.0.11-SNAPSHOT.war
[INFO] Retrieving previous metadata from apache-maven-snapshots
[INFO] Uploading project information for tobago-example-demo 1.0.11-SNAPSHOT
[INFO] Retrieving previous metadata from apache-maven-snapshots
[INFO] Uploading repository metadata for: 'artifact org.apache.myfaces.tobago:tobago-example-demo'
[INFO] Retrieving previous metadata from apache-maven-snapshots
[INFO] Uploading repository metadata for: 'snapshot org.apache.myfaces.tobago:tobago-example-demo:1.0.11-SNAPSHOT'
[INFO] Preparing checkstyle:check
[INFO] Setting property: classpath.resource.loader.class => 'org.codehaus.plexus.velocity.ContextClassLoaderResourceLoader'.
[INFO] Setting property: velocimacro.messages.on => 'false'.
[INFO] Setting property: resource.loader => 'classpath'.
[INFO] Setting property: resource.manager.logwhenfound => 'false'.
[INFO] ************************************************************** 
[INFO] Starting Jakarta Velocity v1.4
[INFO] RuntimeInstance initializing.
[INFO] Default Properties File: org/apache/velocity/runtime/defaults/velocity.properties
[INFO] Default ResourceManager initializing. (class org.apache.velocity.runtime.resource.ResourceManagerImpl)
[INFO] Resource Loader Instantiated: org.codehaus.plexus.velocity.ContextClassLoaderResourceLoader
[INFO] ClasspathResourceLoader : initialization starting.
[INFO] ClasspathResourceLoader : initialization complete.
[INFO] ResourceCache : initialized. (class org.apache.velocity.runtime.resource.ResourceCacheImpl)
[INFO] Default ResourceManager initialization complete.
[INFO] Loaded System Directive: org.apache.velocity.runtime.directive.Literal
[INFO] Loaded System Directive: org.apache.velocity.runtime.directive.Macro
[INFO] Loaded System Directive: org.apache.velocity.runtime.directive.Parse
[INFO] Loaded System Directive: org.apache.velocity.runtime.directive.Include
[INFO] Loaded System Directive: org.apache.velocity.runtime.directive.Foreach
[INFO] Created: 20 parsers.
[INFO] Velocimacro : initialization starting.
[INFO] Velocimacro : adding VMs from VM library template : VM_global_library.vm
[ERROR] ResourceManager : unable to find resource 'VM_global_library.vm' in any resource loader.
[INFO] Velocimacro : error using  VM library template VM_global_library.vm : org.apache.velocity.exception.ResourceNotFoundException:
Unable to find resource 'VM_global_library.vm'
[INFO] Velocimacro :  VM library template macro registration complete.
[INFO] Velocimacro : allowInline = true : VMs can be defined inline in templates
[INFO] Velocimacro : allowInlineToOverride = false : VMs defined inline may NOT replace previous
VM definitions
[INFO] Velocimacro : allowInlineLocal = false : VMs defined inline will be  global in scope
if allowed.
[INFO] Velocimacro : initialization complete.
[INFO] Velocity successfully started.
[INFO] [checkstyle:checkstyle]
[INFO] There are 1 checkstyle errors.
[INFO] [checkstyle:check]
[INFO] ------------------------------------------------------------------------
[ERROR] BUILD FAILURE
[INFO] ------------------------------------------------------------------------
[INFO] You have 1 checkstyle violation.
[INFO] ------------------------------------------------------------------------
[INFO] For more information, run Maven with the -e switch
[INFO] ------------------------------------------------------------------------
[INFO] Total time: 56 seconds
[INFO] Finished at: Fri Apr 06 21:49:18 GMT+00:00 2007
[INFO] Final Memory: 15M/76M
[INFO] ------------------------------------------------------------------------

****************************************************************************



Mime
View raw message