myfaces-commits mailing list archives

Site index · List index
Message view « Date » · « Thread »
Top « Date » · « Thread »
From "Continuum@myfaces.zones.apache.org" <mrma...@myfaces.zones.apache.org>
Subject [continuum] BUILD FAILURE: Tobago Facelets
Date Thu, 04 Jan 2007 18:49:51 GMT
Online report : http://myfaces.zones.apache.org:8080/continuum/servlet/continuum/target/ProjectBuild.vm/view/ProjectBuild/id/168/buildId/7805
Build statistics:
  State: Failed
  Previous State: Ok
  Started at: Thu, 4 Jan 2007 18:49:36 +0000
  Finished at: Thu, 4 Jan 2007 18:49:51 +0000
  Total time: 14s
  Build Trigger: Schedule
  Exit code: 1
  Building machine hostname: myfaces.zones.apache.org
  Operating system : SunOS(unknown)
  Java version : 1.5.0_09(Sun Microsystems Inc.)

Changes
         bommel          (TOBAGO-217) Create a popup ref tag
             /myfaces/tobago/trunk/contrib/facelets/src/main/java/org/apache/myfaces/tobago/facelets/AbstractTobagoTagLibrary.java
            /myfaces/tobago/trunk/contrib/facelets/src/main/java/org/apache/myfaces/tobago/facelets/PopupReferenceHandler.java
            /myfaces/tobago/trunk/core/src/main/java/org/apache/myfaces/tobago/taglib/component/PopupReferenceTag.java
            /myfaces/tobago/trunk/example/demo/src/main/webapp/overview/toolbar.jsp
        
****************************************************************************
Output:
****************************************************************************
[INFO] Scanning for projects...
[INFO] Searching repository for plugin with prefix: 'checkstyle'.
[INFO] ----------------------------------------------------------------------------
[INFO] Building Tobago Facelets
[INFO]    task-segment: [clean, install, checkstyle:check]
[INFO] ----------------------------------------------------------------------------
[INFO] [clean:clean]
[INFO] Deleting directory /local/continuum-1.0.3-SNAPSHOT/apps/continuum/working-directory/168/target
[INFO] Deleting directory /local/continuum-1.0.3-SNAPSHOT/apps/continuum/working-directory/168/target/classes
[INFO] Deleting directory /local/continuum-1.0.3-SNAPSHOT/apps/continuum/working-directory/168/target/test-classes
[INFO] [cobertura:clean {execution: clean}]
[INFO] [dependency:unpack {execution: unpack-sources}]
[INFO] Configured Artifact: org.apache.myfaces.tobago:tobago-core:sources:1.0.10-SNAPSHOT:jar
[INFO] Expanding: /export/home/mrmaven/.m2/repository/org/apache/myfaces/tobago/tobago-core/1.0.10-SNAPSHOT/tobago-core-1.0.10-SNAPSHOT-sources.jar
into /local/continuum-1.0.3-SNAPSHOT/apps/continuum/working-directory/168/target/tobago-core-sources
Downloading: http://repo1.maven.org/maven2/javax/el/el-api/1.0/el-api-1.0.pom
[WARNING] Unable to get resource from repository central (http://repo1.maven.org/maven2)
[INFO] [apt:execute {execution: tobago-facelet-taglib}]
Note: /local/continuum-1.0.3-SNAPSHOT/apps/continuum/working-directory/168/target/tobago-core-sources/org/apache/myfaces/tobago/taglib/component/TreeOldTag.java
uses or overrides a deprecated API.
Note: Recompile with -Xlint:deprecation for details.
[INFO] [resources:resources]
[INFO] Using default encoding to copy filtered resources.
[INFO] [compiler:compile]
Compiling 13 source files to /local/continuum-1.0.3-SNAPSHOT/apps/continuum/working-directory/168/target/classes
[INFO] [resources:testResources]
[INFO] Using default encoding to copy filtered resources.
[INFO] [compiler:testCompile]
[INFO] No sources to compile
[INFO] [surefire:test]
[INFO] No tests to run.
[INFO] [jar:jar]
[INFO] Building jar: /local/continuum-1.0.3-SNAPSHOT/apps/continuum/working-directory/168/target/tobago-facelets-1.0.10-SNAPSHOT.jar
[INFO] [install:install]
[INFO] Installing /local/continuum-1.0.3-SNAPSHOT/apps/continuum/working-directory/168/target/tobago-facelets-1.0.10-SNAPSHOT.jar
to /export/home/mrmaven/.m2/repository/org/apache/myfaces/tobago/tobago-facelets/1.0.10-SNAPSHOT/tobago-facelets-1.0.10-SNAPSHOT.jar
[INFO] Preparing checkstyle:check
[INFO] Setting property: classpath.resource.loader.class => 'org.codehaus.plexus.velocity.ContextClassLoaderResourceLoader'.
[INFO] Setting property: velocimacro.messages.on => 'false'.
[INFO] Setting property: resource.loader => 'classpath'.
[INFO] Setting property: resource.manager.logwhenfound => 'false'.
[INFO] ************************************************************** 
[INFO] Starting Jakarta Velocity v1.4
[INFO] RuntimeInstance initializing.
[INFO] Default Properties File: org/apache/velocity/runtime/defaults/velocity.properties
[INFO] Default ResourceManager initializing. (class org.apache.velocity.runtime.resource.ResourceManagerImpl)
[INFO] Resource Loader Instantiated: org.codehaus.plexus.velocity.ContextClassLoaderResourceLoader
[INFO] ClasspathResourceLoader : initialization starting.
[INFO] ClasspathResourceLoader : initialization complete.
[INFO] ResourceCache : initialized. (class org.apache.velocity.runtime.resource.ResourceCacheImpl)
[INFO] Default ResourceManager initialization complete.
[INFO] Loaded System Directive: org.apache.velocity.runtime.directive.Literal
[INFO] Loaded System Directive: org.apache.velocity.runtime.directive.Macro
[INFO] Loaded System Directive: org.apache.velocity.runtime.directive.Parse
[INFO] Loaded System Directive: org.apache.velocity.runtime.directive.Include
[INFO] Loaded System Directive: org.apache.velocity.runtime.directive.Foreach
[INFO] Created: 20 parsers.
[INFO] Velocimacro : initialization starting.
[INFO] Velocimacro : adding VMs from VM library template : VM_global_library.vm
[ERROR] ResourceManager : unable to find resource 'VM_global_library.vm' in any resource loader.
[INFO] Velocimacro : error using  VM library template VM_global_library.vm : org.apache.velocity.exception.ResourceNotFoundException:
Unable to find resource 'VM_global_library.vm'
[INFO] Velocimacro :  VM library template macro registration complete.
[INFO] Velocimacro : allowInline = true : VMs can be defined inline in templates
[INFO] Velocimacro : allowInlineToOverride = false : VMs defined inline may NOT replace previous
VM definitions
[INFO] Velocimacro : allowInlineLocal = false : VMs defined inline will be  global in scope
if allowed.
[INFO] Velocimacro : initialization complete.
[INFO] Velocity successfully started.
[INFO] [checkstyle:checkstyle]
[INFO] There are 1 checkstyle errors.
[INFO] [checkstyle:check]
[INFO] ------------------------------------------------------------------------
[ERROR] BUILD FAILURE
[INFO] ------------------------------------------------------------------------
[INFO] You have 1 checkstyle violation.
[INFO] ------------------------------------------------------------------------
[INFO] For more information, run Maven with the -e switch
[INFO] ------------------------------------------------------------------------
[INFO] Total time: 13 seconds
[INFO] Finished at: Thu Jan 04 18:49:50 GMT+00:00 2007
[INFO] Final Memory: 21M/331M
[INFO] ------------------------------------------------------------------------

****************************************************************************



Mime
View raw message