myfaces-commits mailing list archives

Site index · List index
Message view « Date » · « Thread »
Top « Date » · « Thread »
From "Continuum@myfaces.zones.apache.org" <mrma...@myfaces.zones.apache.org>
Subject [continuum] BUILD FAILURE: Tomahawk Core
Date Sat, 30 Dec 2006 15:28:13 GMT
Online report : http://myfaces.zones.apache.org:8080/continuum/servlet/continuum/target/ProjectBuild.vm/view/ProjectBuild/id/16/buildId/7643
Build statistics:
  State: Failed
  Previous State: Failed
  Started at: Sat, 30 Dec 2006 15:25:37 +0000
  Finished at: Sat, 30 Dec 2006 15:28:13 +0000
  Total time: 2m 35s
  Build Trigger: Schedule
  Exit code: 1
  Building machine hostname: myfaces.zones.apache.org
  Operating system : SunOS(unknown)
  Java version : 1.5.0_09(Sun Microsystems Inc.)

Changes
         paulsp          TOMAHAWK-836 - Added an abstract class for testing that add Tomahawk
renderers. Existing test must be updated to extend this class.
             /myfaces/tomahawk/trunk/core/pom.xml
            /myfaces/tomahawk/trunk/core/src/test/java/org/apache/myfaces/test/AbstractTomahawkJsfTestCase.java
            /myfaces/tomahawk/trunk/core/src/test/java/org/apache/myfaces/test/utils
            /myfaces/tomahawk/trunk/core/src/test/java/org/apache/myfaces/test/utils/TestUtils.java
        
****************************************************************************
Output:
****************************************************************************
[INFO] Scanning for projects...
[INFO] Searching repository for plugin with prefix: 'source'.
[INFO] ----------------------------------------------------------------------------
[INFO] Building Tomahawk Core
[INFO]    task-segment: [clean, install, source:jar, deploy, site-deploy]
[INFO] ----------------------------------------------------------------------------
[INFO] [clean:clean]
[INFO] Deleting directory /local/continuum-1.0.3-SNAPSHOT/apps/continuum/working-directory/16/target
[INFO] Deleting directory /local/continuum-1.0.3-SNAPSHOT/apps/continuum/working-directory/16/target/classes
[INFO] Deleting directory /local/continuum-1.0.3-SNAPSHOT/apps/continuum/working-directory/16/target/test-classes
[INFO] [dependency:unpack {execution: unpack-shared-impl-sources}]
[INFO] Configured Artifact: org.apache.myfaces.shared:myfaces-shared-tomahawk:sources:2.0.5-SNAPSHOT:jar
[INFO] Expanding: /export/home/mrmaven/.m2/repository/org/apache/myfaces/shared/myfaces-shared-tomahawk/2.0.5-SNAPSHOT/myfaces-shared-tomahawk-2.0.5-SNAPSHOT-sources.jar
into /local/continuum-1.0.3-SNAPSHOT/apps/continuum/working-directory/16/target/shared_sources
[INFO] [xslt:transform {execution: default}]
[INFO] # of XML files: 1
[INFO] transform, srcFile: /local/continuum-1.0.3-SNAPSHOT/apps/continuum/working-directory/16/src/main/tld/tomahawk.tld,
destFile: /local/continuum-1.0.3-SNAPSHOT/apps/continuum/working-directory/16/target/classes/META-INF/tomahawk.tld
[INFO] [xslt:transform {execution: generate-tld-for-jar}]
[INFO] # of XML files: 1
[INFO] file up-to-date: /local/continuum-1.0.3-SNAPSHOT/apps/continuum/working-directory/16/target/classes/META-INF/tomahawk.tld
[INFO] [xslt:transform {execution: generate-tld-for-tlddoc}]
[INFO] # of XML files: 1
[INFO] transform, srcFile: /local/continuum-1.0.3-SNAPSHOT/apps/continuum/working-directory/16/src/main/tld/tomahawk.tld,
destFile: /local/continuum-1.0.3-SNAPSHOT/apps/continuum/working-directory/16/target/tlddoc-site/tomahawk.tld
[INFO] [build-helper:add-source {execution: add-source}]
[INFO] Source directory: /local/continuum-1.0.3-SNAPSHOT/apps/continuum/working-directory/16/target/shared_sources
added.
[INFO] [resources:resources]
[INFO] Using default encoding to copy filtered resources.
[INFO] [compiler:compile]
Compiling 419 source files to /local/continuum-1.0.3-SNAPSHOT/apps/continuum/working-directory/16/target/classes
[INFO] [dependency:unpack {execution: unpack-shared-tomahawk}]
[INFO] Configured Artifact: org.apache.myfaces.shared:myfaces-shared-tomahawk:null:2.0.5-SNAPSHOT:jar
[INFO] myfaces-shared-tomahawk-2.0.5-SNAPSHOT.jar already unpacked.
[INFO] [resources:testResources]
[INFO] Using default encoding to copy filtered resources.
[INFO] [compiler:testCompile]
Compiling 28 source files to /local/continuum-1.0.3-SNAPSHOT/apps/continuum/working-directory/16/target/test-classes
[INFO] ------------------------------------------------------------------------
[ERROR] BUILD FAILURE
[INFO] ------------------------------------------------------------------------
[INFO] Compilation failure

/local/continuum-1.0.3-SNAPSHOT/apps/continuum/working-directory/16/src/test/java/org/apache/myfaces/test/MyFacesTagLibTestCase.java:[22,34]
package net.sf.maventaglib.checker does not exist

/local/continuum-1.0.3-SNAPSHOT/apps/continuum/working-directory/16/src/test/java/org/apache/myfaces/test/AbstractTagLibTestCase.java:[30,34]
package net.sf.maventaglib.checker does not exist

/local/continuum-1.0.3-SNAPSHOT/apps/continuum/working-directory/16/src/test/java/org/apache/myfaces/test/AbstractTagLibTestCase.java:[31,34]
package net.sf.maventaglib.checker does not exist

/local/continuum-1.0.3-SNAPSHOT/apps/continuum/working-directory/16/src/test/java/org/apache/myfaces/test/AbstractTagLibTestCase.java:[32,34]
package net.sf.maventaglib.checker does not exist

/local/continuum-1.0.3-SNAPSHOT/apps/continuum/working-directory/16/src/test/java/org/apache/myfaces/test/AbstractTagLibTestCase.java:[33,34]
package net.sf.maventaglib.checker does not exist

/local/continuum-1.0.3-SNAPSHOT/apps/continuum/working-directory/16/src/test/java/org/apache/myfaces/test/AbstractTagLibTestCase.java:[57,18]
cannot find symbol
symbol  : class Tld
location: class org.apache.myfaces.test.AbstractTagLibTestCase

/local/continuum-1.0.3-SNAPSHOT/apps/continuum/working-directory/16/src/test/java/org/apache/myfaces/test/AbstractTagLibTestCase.java:[129,53]
cannot find symbol
symbol  : class Tag
location: class org.apache.myfaces.test.AbstractTagLibTestCase

/local/continuum-1.0.3-SNAPSHOT/apps/continuum/working-directory/16/src/test/java/org/apache/myfaces/test/AbstractTagLibTestCase.java:[172,41]
cannot find symbol
symbol  : class Tag
location: class org.apache.myfaces.test.AbstractTagLibTestCase

/local/continuum-1.0.3-SNAPSHOT/apps/continuum/working-directory/16/src/test/java/org/apache/myfaces/test/AbstractTagLibTestCase.java:[194,30]
cannot find symbol
symbol  : class Tld
location: class org.apache.myfaces.test.AbstractTagLibTestCase.TldTestUtils

/local/continuum-1.0.3-SNAPSHOT/apps/continuum/working-directory/16/src/test/java/org/apache/myfaces/test/AbstractTagLibTestCase.java:[206,32]
cannot find symbol
symbol  : class TagAttribute
location: class org.apache.myfaces.test.AbstractTagLibTestCase.TldTestUtils

/local/continuum-1.0.3-SNAPSHOT/apps/continuum/working-directory/16/src/test/java/org/apache/myfaces/test/AbstractTagLibTestCase.java:[205,30]
cannot find symbol
symbol  : class TagAttribute
location: class org.apache.myfaces.test.AbstractTagLibTestCase.TldTestUtils

/local/continuum-1.0.3-SNAPSHOT/apps/continuum/working-directory/16/src/test/java/org/apache/myfaces/test/AbstractTagLibTestCase.java:[216,60]
cannot find symbol
symbol  : class Tag
location: class org.apache.myfaces.test.AbstractTagLibTestCase.TldTestUtils

/local/continuum-1.0.3-SNAPSHOT/apps/continuum/working-directory/16/src/test/java/org/apache/myfaces/test/AbstractTagLibTestCase.java:[216,30]
cannot find symbol
symbol  : class Tag
location: class org.apache.myfaces.test.AbstractTagLibTestCase.TldTestUtils

/local/continuum-1.0.3-SNAPSHOT/apps/continuum/working-directory/16/src/test/java/org/apache/myfaces/test/AbstractTagLibTestCase.java:[226,57]
cannot find symbol
symbol  : class Tag
location: class org.apache.myfaces.test.AbstractTagLibTestCase.TldTestUtils

/local/continuum-1.0.3-SNAPSHOT/apps/continuum/working-directory/16/src/test/java/org/apache/myfaces/test/AbstractTagLibTestCase.java:[95,24]
cannot find symbol
symbol  : class Tld
location: class org.apache.myfaces.test.AbstractTagLibTestCase

/local/continuum-1.0.3-SNAPSHOT/apps/continuum/working-directory/16/src/test/java/org/apache/myfaces/test/AbstractTagLibTestCase.java:[97,24]
cannot find symbol
symbol  : class Tag
location: class org.apache.myfaces.test.AbstractTagLibTestCase

/local/continuum-1.0.3-SNAPSHOT/apps/continuum/working-directory/16/src/test/java/org/apache/myfaces/test/AbstractTagLibTestCase.java:[100,32]
cannot find symbol
symbol  : class Tag
location: class org.apache.myfaces.test.AbstractTagLibTestCase

/local/continuum-1.0.3-SNAPSHOT/apps/continuum/working-directory/16/src/test/java/org/apache/myfaces/test/AbstractTagLibTestCase.java:[117,24]
cannot find symbol
symbol  : class Tld
location: class org.apache.myfaces.test.AbstractTagLibTestCase

/local/continuum-1.0.3-SNAPSHOT/apps/continuum/working-directory/16/src/test/java/org/apache/myfaces/test/AbstractTagLibTestCase.java:[118,24]
cannot find symbol
symbol  : class Tag
location: class org.apache.myfaces.test.AbstractTagLibTestCase

/local/continuum-1.0.3-SNAPSHOT/apps/continuum/working-directory/16/src/test/java/org/apache/myfaces/test/AbstractTagLibTestCase.java:[122,32]
cannot find symbol
symbol  : class Tag
location: class org.apache.myfaces.test.AbstractTagLibTestCase

/local/continuum-1.0.3-SNAPSHOT/apps/continuum/working-directory/16/src/test/java/org/apache/myfaces/test/AbstractTagLibTestCase.java:[132,16]
cannot find symbol
symbol  : class TagAttribute
location: class org.apache.myfaces.test.AbstractTagLibTestCase

/local/continuum-1.0.3-SNAPSHOT/apps/continuum/working-directory/16/src/test/java/org/apache/myfaces/test/AbstractTagLibTestCase.java:[137,24]
cannot find symbol
symbol  : class TagAttribute
location: class org.apache.myfaces.test.AbstractTagLibTestCase

/local/continuum-1.0.3-SNAPSHOT/apps/continuum/working-directory/16/src/test/java/org/apache/myfaces/test/AbstractTagLibTestCase.java:[156,24]
cannot find symbol
symbol  : class Tld
location: class org.apache.myfaces.test.AbstractTagLibTestCase

/local/continuum-1.0.3-SNAPSHOT/apps/continuum/working-directory/16/src/test/java/org/apache/myfaces/test/AbstractTagLibTestCase.java:[157,24]
cannot find symbol
symbol  : class Tag
location: class org.apache.myfaces.test.AbstractTagLibTestCase

/local/continuum-1.0.3-SNAPSHOT/apps/continuum/working-directory/16/src/test/java/org/apache/myfaces/test/AbstractTagLibTestCase.java:[160,32]
cannot find symbol
symbol  : class Tag
location: class org.apache.myfaces.test.AbstractTagLibTestCase

/local/continuum-1.0.3-SNAPSHOT/apps/continuum/working-directory/16/src/test/java/org/apache/myfaces/test/AbstractTagLibTestCase.java:[175,16]
cannot find symbol
symbol  : class TagAttribute
location: class org.apache.myfaces.test.AbstractTagLibTestCase

/local/continuum-1.0.3-SNAPSHOT/apps/continuum/working-directory/16/src/test/java/org/apache/myfaces/test/AbstractTagLibTestCase.java:[178,24]
cannot find symbol
symbol  : class TagAttribute
location: class org.apache.myfaces.test.AbstractTagLibTestCase

/local/continuum-1.0.3-SNAPSHOT/apps/continuum/working-directory/16/src/test/java/org/apache/myfaces/test/AbstractTagLibTestCase.java:[202,31]
cannot find symbol
symbol  : variable TldParser
location: class org.apache.myfaces.test.AbstractTagLibTestCase.TldTestUtils

/local/continuum-1.0.3-SNAPSHOT/apps/continuum/working-directory/16/src/test/java/org/apache/myfaces/test/AbstractTagLibTestCase.java:[209,32]
cannot find symbol
symbol  : class TagAttribute
location: class org.apache.myfaces.test.AbstractTagLibTestCase.TldTestUtils

/local/continuum-1.0.3-SNAPSHOT/apps/continuum/working-directory/16/src/test/java/org/apache/myfaces/test/AbstractTagLibTestCase.java:[219,32]
cannot find symbol
symbol  : class Tag
location: class org.apache.myfaces.test.AbstractTagLibTestCase.TldTestUtils

/local/continuum-1.0.3-SNAPSHOT/apps/continuum/working-directory/16/src/test/java/org/apache/myfaces/test/MyFacesTagLibTestCase.java:[42,27]
cannot find symbol
symbol  : class Tld
location: class org.apache.myfaces.test.MyFacesTagLibTestCase


[INFO] ------------------------------------------------------------------------
[INFO] For more information, run Maven with the -e switch
[INFO] ------------------------------------------------------------------------
[INFO] Total time: 2 minutes 34 seconds
[INFO] Finished at: Sat Dec 30 15:28:12 GMT+00:00 2006
[INFO] Final Memory: 22M/321M
[INFO] ------------------------------------------------------------------------

****************************************************************************



Mime
View raw message