myfaces-commits mailing list archives

Site index · List index
Message view « Date » · « Thread »
Top « Date » · « Thread »
From "Continuum@myfaces.zones.apache.org" <mrma...@myfaces.zones.apache.org>
Subject [continuum] BUILD FAILURE: Impl
Date Mon, 13 Mar 2006 17:10:34 GMT
Online report : http://myfaces.zones.apache.org:8080/continuum/servlet/continuum/target/ProjectBuild.vm/view/ProjectBuild/id/7/buildId/69
Build statistics:
  State: Failed
  Previous State: Ok
  Started at: Mon, 13 Mar 2006 17:09:51 +0000
  Finished at: Mon, 13 Mar 2006 17:10:34 +0000
  Total time: 42s
  Build Trigger: Schedule
  Exit code: 1
  Building machine hostname: myfaces.zones.apache.org
  Operating system : SunOS(unknown)
  Java version : 1.5.0_06(Sun Microsystems Inc.)

Changes
                            src/main/java/org/apache/myfaces/application/jsp/JspStateManagerImpl.java
        
****************************************************************************
Output:
****************************************************************************
[INFO] Scanning for projects...
[INFO] ----------------------------------------------------------------------------
[INFO] Building Impl
[INFO]    task-segment: [clean, install, deploy, site-deploy]
[INFO] ----------------------------------------------------------------------------
[INFO] [clean:clean]
[INFO] Deleting directory /local/continuum-1.0.2/apps/continuum/working-directory/7/target
[INFO] Deleting directory /local/continuum-1.0.2/apps/continuum/working-directory/7/target/classes
[INFO] Deleting directory /local/continuum-1.0.2/apps/continuum/working-directory/7/target/test-classes
[INFO] [xslt:transform {execution: default}]
[INFO] # of XML files: 2
[INFO] transform, srcFile: /local/continuum-1.0.2/apps/continuum/working-directory/7/src/main/tld/myfaces_core.tld,
destFile: /local/continuum-1.0.2/apps/continuum/working-directory/7/target/classes/META-INF/myfaces_core.tld
[INFO] transform, srcFile: /local/continuum-1.0.2/apps/continuum/working-directory/7/src/main/tld/myfaces_html.tld,
destFile: /local/continuum-1.0.2/apps/continuum/working-directory/7/target/classes/META-INF/myfaces_html.tld
[INFO] [xslt:transform {execution: generate-tld-for-jar}]
[INFO] # of XML files: 2
[INFO] file up-to-date: /local/continuum-1.0.2/apps/continuum/working-directory/7/target/classes/META-INF/myfaces_core.tld
[INFO] file up-to-date: /local/continuum-1.0.2/apps/continuum/working-directory/7/target/classes/META-INF/myfaces_html.tld
[INFO] [xslt:transform {execution: generate-tld-for-tlddoc}]
[INFO] # of XML files: 2
[INFO] transform, srcFile: /local/continuum-1.0.2/apps/continuum/working-directory/7/src/main/tld/myfaces_core.tld,
destFile: /local/continuum-1.0.2/apps/continuum/working-directory/7/target/tlddoc-site/myfaces_core.tld
[INFO] transform, srcFile: /local/continuum-1.0.2/apps/continuum/working-directory/7/src/main/tld/myfaces_html.tld,
destFile: /local/continuum-1.0.2/apps/continuum/working-directory/7/target/tlddoc-site/myfaces_html.tld
[INFO] [resources:resources]
[INFO] Using default encoding to copy filtered resources.
[INFO] [compiler:compile]
Compiling 149 source files to /local/continuum-1.0.2/apps/continuum/working-directory/7/target/classes
[INFO] ----------------------------------------------------------------------------
[ERROR] BUILD FAILURE
[INFO] ----------------------------------------------------------------------------
[INFO] Compilation failure

/local/continuum-1.0.2/apps/continuum/working-directory/7/src/main/java/org/apache/myfaces/application/jsp/JspStateManagerImpl.java:[56,43]
cannot find symbol
symbol  : class MyFacesObjectInputStream
location: package org.apache.myfaces.shared_impl.util

/local/continuum-1.0.2/apps/continuum/working-directory/7/src/main/java/org/apache/myfaces/application/jsp/JspStateManagerImpl.java:[662,43]
cannot find symbol
symbol  : class MyFacesObjectInputStream
location: class org.apache.myfaces.application.jsp.JspStateManagerImpl


[INFO] ----------------------------------------------------------------------------
[INFO] For more information, run Maven with the -e switch
[INFO] ----------------------------------------------------------------------------
[INFO] Total time: 40 seconds
[INFO] Finished at: Mon Mar 13 17:10:33 GMT+00:00 2006
[INFO] Final Memory: 11M/253M
[INFO] ----------------------------------------------------------------------------

****************************************************************************



Mime
View raw message