mina-commits mailing list archives

Site index · List index
Message view « Date » · « Thread »
Top « Date » · « Thread »
From Apache Jenkins Server <jenk...@builds.apache.org>
Subject Build failed in Jenkins: MINA-trunk-jdk1.6-ubuntu #265
Date Sat, 17 Sep 2011 05:58:03 GMT
See <https://builds.apache.org/job/MINA-trunk-jdk1.6-ubuntu/265/changes>

Changes:

[jvermillard] svn-ignore

[jvermillard] DIRMINA-861 example sub project

------------------------------------------
[...truncated 41 lines...]
Parsing POMs
Modules changed, recalculating dependency graph
[trunk] $ /home/hudson/tools/java/latest1.6/bin/java -cp /home/jenkins/jenkins-slave/maven-agent.jar:/home/jenkins/jenkins-slave/classworlds.jar
hudson.maven.agent.Main /home/hudson/tools/maven/latest /home/jenkins/jenkins-slave/slave.jar
/home/jenkins/jenkins-slave/maven-interceptor.jar 57848 /home/jenkins/jenkins-slave/maven2.1-interceptor.jar
<channel started
===[JENKINS REMOTING CAPACITY]===>   Executing Maven:  -B -f <https://builds.apache.org/job/MINA-trunk-jdk1.6-ubuntu/ws/trunk/pom.xml>
clean install -Pserial
[INFO] Scanning for projects...
[WARNING] 
	Profile with id: 'serial' has not been activated.

[INFO] Reactor build order: 
[INFO]   Apache MINA
[INFO]   Apache MINA Core
[INFO]   Apache MINA HTTP
[INFO] ------------------------------------------------------------------------
[INFO] Building Apache MINA
[INFO]    task-segment: [clean, install]
[INFO] ------------------------------------------------------------------------
[INFO] [clean:clean {execution: default-clean}]
[INFO] [site:attach-descriptor {execution: default-attach-descriptor}]
[INFO] Preparing source:jar
[WARNING] Removing: jar from forked lifecycle, to prevent recursive invocation.
[INFO] No goals needed for project - skipping
[INFO] [source:jar {execution: attach-source}]
[INFO] [install:install {execution: default-install}]
[INFO] Installing <https://builds.apache.org/job/MINA-trunk-jdk1.6-ubuntu/ws/trunk/pom.xml>
to /home/jenkins/.m2/repository/org/apache/mina/mina-parent/3.0.0-M1-SNAPSHOT/mina-parent-3.0.0-M1-SNAPSHOT.pom
[JENKINS] Archiving <https://builds.apache.org/job/MINA-trunk-jdk1.6-ubuntu/ws/trunk/pom.xml>
to /home/hudson/hudson/jobs/MINA-trunk-jdk1.6-ubuntu/modules/org.apache.mina$mina-parent/builds/2011-09-17_05-56-23/archive/org.apache.mina/mina-parent/3.0.0-M1-SNAPSHOT/mina-parent-3.0.0-M1-SNAPSHOT.pom
[INFO] ------------------------------------------------------------------------
[INFO] Building Apache MINA Core
[INFO]    task-segment: [clean, install]
[INFO] ------------------------------------------------------------------------
[INFO] [clean:clean {execution: default-clean}]
[INFO] Deleting directory <https://builds.apache.org/job/MINA-trunk-jdk1.6-ubuntu/ws/trunk/core/target>
[INFO] [resources:resources {execution: default-resources}]
[WARNING] Using platform encoding (ANSI_X3.4-1968 actually) to copy filtered resources, i.e.
build is platform dependent!
[INFO] skip non existing resourceDirectory <https://builds.apache.org/job/MINA-trunk-jdk1.6-ubuntu/ws/trunk/core/src/main/resources>
[INFO] [compiler:compile {execution: default-compile}]
[INFO] Compiling 44 source files to <https://builds.apache.org/job/MINA-trunk-jdk1.6-ubuntu/ws/trunk/core/target/classes>
[INFO] [resources:testResources {execution: default-testResources}]
[WARNING] Using platform encoding (ANSI_X3.4-1968 actually) to copy filtered resources, i.e.
build is platform dependent!
[INFO] Copying 1 resource
[INFO] [compiler:testCompile {execution: default-testCompile}]
[INFO] Compiling 4 source files to <https://builds.apache.org/job/MINA-trunk-jdk1.6-ubuntu/ws/trunk/core/target/test-classes>
[INFO] [surefire:test {execution: default-test}]
[INFO] Surefire report directory: <https://builds.apache.org/job/MINA-trunk-jdk1.6-ubuntu/ws/trunk/core/target/surefire-reports>

-------------------------------------------------------
 T E S T S
-------------------------------------------------------
Running org.apache.mina.util.AbstractIoFutureTest
[05:57:08] DEBUG [org.apache.mina.util.AbstractIoFuture] - registering listener Mock for IoFutureListener,
hashCode: 28399250
[05:57:08] DEBUG [org.apache.mina.util.AbstractIoFuture] - future is not done, adding listener
to listener set
[05:57:08] DEBUG [org.apache.mina.util.AbstractIoFuture] - Calling the default result scheduler
[05:57:08] DEBUG [org.apache.mina.util.AbstractIoFuture] - registering listener Mock for IoFutureListener,
hashCode: 31706449
[05:57:08] DEBUG [org.apache.mina.util.AbstractIoFuture] - future is done calling listener
[05:57:08] DEBUG [org.apache.mina.util.AbstractIoFuture] - Calling the default result scheduler
[05:57:09] DEBUG [org.apache.mina.util.AbstractIoFuture] - registering listener Mock for IoFutureListener,
hashCode: 13676443
[05:57:09] DEBUG [org.apache.mina.util.AbstractIoFuture] - future is not done, adding listener
to listener set
[05:57:09] DEBUG [org.apache.mina.util.AbstractIoFuture] - Calling the default exception scheduler
[05:57:09] DEBUG [org.apache.mina.util.AbstractIoFuture] - registering listener Mock for IoFutureListener,
hashCode: 31332340
[05:57:09] DEBUG [org.apache.mina.util.AbstractIoFuture] - future is done calling listener
[05:57:09] DEBUG [org.apache.mina.util.AbstractIoFuture] - Calling the default exception scheduler
[05:57:10] DEBUG [org.apache.mina.util.AbstractIoFuture] - Attempting to cancel
[05:57:10] DEBUG [org.apache.mina.util.AbstractIoFuture] - Successfully cancelled
[05:57:10] DEBUG [org.apache.mina.util.AbstractIoFuture] - Calling listeners
[05:57:10] DEBUG [org.apache.mina.util.AbstractIoFuture] - Attempting to cancel
[05:57:10] DEBUG [org.apache.mina.util.AbstractIoFuture] - Unable to cancel
[05:57:10] DEBUG [org.apache.mina.util.AbstractIoFuture] - Attempting to cancel
[05:57:10] DEBUG [org.apache.mina.util.AbstractIoFuture] - Unable to cancel
[05:57:10] DEBUG [org.apache.mina.util.AbstractIoFuture] - Attempting to cancel
[05:57:10] DEBUG [org.apache.mina.util.AbstractIoFuture] - Unable to cancel
[05:57:10] DEBUG [org.apache.mina.util.AbstractIoFuture] - registering listener Mock for IoFutureListener,
hashCode: 30604342
[05:57:10] DEBUG [org.apache.mina.util.AbstractIoFuture] - future is not done, adding listener
to listener set
[05:57:10] DEBUG [org.apache.mina.util.AbstractIoFuture] - Attempting to cancel
[05:57:10] DEBUG [org.apache.mina.util.AbstractIoFuture] - Successfully cancelled
[05:57:10] DEBUG [org.apache.mina.util.AbstractIoFuture] - Calling listeners
[05:57:10] DEBUG [org.apache.mina.util.AbstractIoFuture] - Calling the default exception scheduler
[05:57:10] DEBUG [org.apache.mina.util.AbstractIoFuture] - Attempting to cancel
[05:57:10] DEBUG [org.apache.mina.util.AbstractIoFuture] - Successfully cancelled
[05:57:10] DEBUG [org.apache.mina.util.AbstractIoFuture] - Calling listeners
[05:57:10] DEBUG [org.apache.mina.util.AbstractIoFuture] - registering listener Mock for IoFutureListener,
hashCode: 24446859
[05:57:10] DEBUG [org.apache.mina.util.AbstractIoFuture] - future is done calling listener
[05:57:10] DEBUG [org.apache.mina.util.AbstractIoFuture] - Calling the default exception scheduler
Tests run: 15, Failures: 0, Errors: 0, Skipped: 0, Time elapsed: 2.313 sec
Running org.apache.mina.filterchain.DefaultIoFilterChainTest
Tests run: 1, Failures: 0, Errors: 1, Skipped: 0, Time elapsed: 0.006 sec <<< FAILURE!
Running org.apache.mina.transport.socket.nio.NioAcceptorTest
[05:57:11] INFO [org.apache.mina.transport.socket.nio.NioAcceptorTest] - starting NioAcceptorTest
[05:57:11] DEBUG [org.apache.mina.transport.tcp.nio.NioTcpServer] - binding address 0.0.0.0/0.0.0.0:9999
[05:57:11] DEBUG [org.apache.mina.transport.tcp.NioSelectorProcessor] - adding a server channel
sun.nio.ch.ServerSocketChannelImpl[/0:0:0:0:0:0:0:0:9999] for server org.apache.mina.transport.tcp.nio.NioTcpServer@19b1de
[05:57:11] DEBUG [org.apache.mina.transport.tcp.NioSelectorProcessor] - opening a new selector
[05:57:11] INFO [org.apache.mina.transport.socket.nio.NioAcceptorTest] - service activated
org.apache.mina.transport.tcp.nio.NioTcpServer@19b1de
[05:57:11] DEBUG [org.apache.mina.transport.socket.nio.NioAcceptorTest] - Waiting 25 sec
[05:57:11] DEBUG [org.apache.mina.transport.tcp.NioSelectorProcessor] - selecting...
[05:57:12] DEBUG [org.apache.mina.transport.tcp.NioSelectorProcessor] - ... done selecting
: 0
[05:57:12] DEBUG [org.apache.mina.transport.tcp.NioSelectorProcessor] - selecting...
[05:57:13] DEBUG [org.apache.mina.transport.tcp.NioSelectorProcessor] - ... done selecting
: 0
[05:57:13] DEBUG [org.apache.mina.transport.tcp.NioSelectorProcessor] - selecting...
[05:57:14] DEBUG [org.apache.mina.transport.tcp.NioSelectorProcessor] - ... done selecting
: 0
[05:57:14] DEBUG [org.apache.mina.transport.tcp.NioSelectorProcessor] - selecting...
[05:57:15] DEBUG [org.apache.mina.transport.tcp.NioSelectorProcessor] - ... done selecting
: 0
[05:57:15] DEBUG [org.apache.mina.transport.tcp.NioSelectorProcessor] - selecting...
[05:57:16] DEBUG [org.apache.mina.transport.tcp.NioSelectorProcessor] - ... done selecting
: 0
[05:57:16] DEBUG [org.apache.mina.transport.tcp.NioSelectorProcessor] - selecting...
[05:57:17] DEBUG [org.apache.mina.transport.tcp.NioSelectorProcessor] - ... done selecting
: 0
[05:57:17] DEBUG [org.apache.mina.transport.tcp.NioSelectorProcessor] - selecting...
[05:57:18] DEBUG [org.apache.mina.transport.tcp.NioSelectorProcessor] - ... done selecting
: 0
[05:57:18] DEBUG [org.apache.mina.transport.tcp.NioSelectorProcessor] - selecting...
[05:57:19] DEBUG [org.apache.mina.transport.tcp.NioSelectorProcessor] - ... done selecting
: 0
[05:57:19] DEBUG [org.apache.mina.transport.tcp.NioSelectorProcessor] - selecting...
[05:57:20] DEBUG [org.apache.mina.transport.tcp.NioSelectorProcessor] - ... done selecting
: 0
[05:57:20] DEBUG [org.apache.mina.transport.tcp.NioSelectorProcessor] - selecting...
[05:57:21] DEBUG [org.apache.mina.transport.tcp.NioSelectorProcessor] - ... done selecting
: 0
[05:57:21] DEBUG [org.apache.mina.transport.tcp.NioSelectorProcessor] - selecting...
[05:57:22] DEBUG [org.apache.mina.transport.tcp.NioSelectorProcessor] - ... done selecting
: 0
[05:57:22] DEBUG [org.apache.mina.transport.tcp.NioSelectorProcessor] - selecting...
[05:57:23] DEBUG [org.apache.mina.transport.tcp.NioSelectorProcessor] - ... done selecting
: 0
[05:57:23] DEBUG [org.apache.mina.transport.tcp.NioSelectorProcessor] - selecting...
[05:57:24] DEBUG [org.apache.mina.transport.tcp.NioSelectorProcessor] - ... done selecting
: 0
[05:57:24] DEBUG [org.apache.mina.transport.tcp.NioSelectorProcessor] - selecting...
[05:57:25] DEBUG [org.apache.mina.transport.tcp.NioSelectorProcessor] - ... done selecting
: 0
[05:57:25] DEBUG [org.apache.mina.transport.tcp.NioSelectorProcessor] - selecting...
[05:57:26] DEBUG [org.apache.mina.transport.tcp.NioSelectorProcessor] - ... done selecting
: 0
[05:57:26] DEBUG [org.apache.mina.transport.tcp.NioSelectorProcessor] - selecting...
[05:57:27] DEBUG [org.apache.mina.transport.tcp.NioSelectorProcessor] - ... done selecting
: 0
[05:57:27] DEBUG [org.apache.mina.transport.tcp.NioSelectorProcessor] - selecting...
[05:57:28] DEBUG [org.apache.mina.transport.tcp.NioSelectorProcessor] - ... done selecting
: 0
[05:57:28] DEBUG [org.apache.mina.transport.tcp.NioSelectorProcessor] - selecting...
[05:57:29] DEBUG [org.apache.mina.transport.tcp.NioSelectorProcessor] - ... done selecting
: 0
[05:57:29] DEBUG [org.apache.mina.transport.tcp.NioSelectorProcessor] - selecting...
[05:57:30] DEBUG [org.apache.mina.transport.tcp.NioSelectorProcessor] - ... done selecting
: 0
[05:57:30] DEBUG [org.apache.mina.transport.tcp.NioSelectorProcessor] - selecting...
[05:57:31] DEBUG [org.apache.mina.transport.tcp.NioSelectorProcessor] - ... done selecting
: 0
[05:57:31] DEBUG [org.apache.mina.transport.tcp.NioSelectorProcessor] - selecting...
[05:57:32] DEBUG [org.apache.mina.transport.tcp.NioSelectorProcessor] - ... done selecting
: 0
[05:57:32] DEBUG [org.apache.mina.transport.tcp.NioSelectorProcessor] - selecting...
[05:57:33] DEBUG [org.apache.mina.transport.tcp.NioSelectorProcessor] - ... done selecting
: 0
[05:57:33] DEBUG [org.apache.mina.transport.tcp.NioSelectorProcessor] - selecting...
[05:57:34] DEBUG [org.apache.mina.transport.tcp.NioSelectorProcessor] - ... done selecting
: 0
[05:57:34] DEBUG [org.apache.mina.transport.tcp.NioSelectorProcessor] - selecting...
[05:57:35] DEBUG [org.apache.mina.transport.tcp.NioSelectorProcessor] - ... done selecting
: 0
[05:57:35] DEBUG [org.apache.mina.transport.tcp.NioSelectorProcessor] - selecting...
[05:57:36] DEBUG [org.apache.mina.transport.socket.nio.NioAcceptorTest] - Unbinding
[05:57:36] DEBUG [org.apache.mina.transport.tcp.nio.NioTcpServer] - unbinding 0.0.0.0/0.0.0.0:9999
[05:57:36] DEBUG [org.apache.mina.transport.tcp.NioSelectorProcessor] - Removing a server
channel sun.nio.ch.ServerSocketChannelImpl[closed]
[05:57:36] INFO [org.apache.mina.transport.socket.nio.NioAcceptorTest] - service deactivated
org.apache.mina.transport.tcp.nio.NioTcpServer@19b1de
[05:57:36] DEBUG [org.apache.mina.transport.socket.nio.NioAcceptorTest] - Trying to rebind
the freed port
[05:57:36] DEBUG [org.apache.mina.transport.tcp.nio.NioTcpServer] - binding address 0.0.0.0/0.0.0.0:9999
[05:57:36] DEBUG [org.apache.mina.transport.tcp.NioSelectorProcessor] - ... done selecting
: 0
[05:57:36] DEBUG [org.apache.mina.transport.tcp.NioSelectorProcessor] - adding a server channel
sun.nio.ch.ServerSocketChannelImpl[/0:0:0:0:0:0:0:0:9999] for server org.apache.mina.transport.tcp.nio.NioTcpServer@19b1de
[05:57:36] INFO [org.apache.mina.transport.socket.nio.NioAcceptorTest] - service activated
org.apache.mina.transport.tcp.nio.NioTcpServer@19b1de
[05:57:36] DEBUG [org.apache.mina.transport.socket.nio.NioAcceptorTest] - Bound
[05:57:36] ERROR [org.apache.mina.transport.tcp.NioSelectorProcessor] - The server socket
was already removed of the selector
[05:57:36] INFO [org.apache.mina.transport.socket.nio.NioAcceptorTest] - Trying to bind an
already bound port
[05:57:36] DEBUG [org.apache.mina.transport.tcp.NioSelectorProcessor] - selecting...
[05:57:36] DEBUG [org.apache.mina.transport.tcp.NioSelectorProcessor] - ... done selecting
: 0
[05:57:36] DEBUG [org.apache.mina.transport.tcp.NioSelectorProcessor] - selecting...
[05:57:36] INFO [org.apache.mina.transport.socket.nio.NioAcceptorTest] - catching the exception
java.io.IOException: address 0.0.0.0/0.0.0.0:9999 already bound
	at org.apache.mina.transport.tcp.nio.NioTcpServer.bind(NioTcpServer.java:68)
	at org.apache.mina.transport.socket.nio.NioAcceptorTest.acceptorTest(NioAcceptorTest.java:115)
	at sun.reflect.NativeMethodAccessorImpl.invoke0(Native Method)
	at sun.reflect.NativeMethodAccessorImpl.invoke(NativeMethodAccessorImpl.java:39)
	at sun.reflect.DelegatingMethodAccessorImpl.invoke(DelegatingMethodAccessorImpl.java:25)
	at java.lang.reflect.Method.invoke(Method.java:597)
	at org.junit.runners.model.FrameworkMethod$1.runReflectiveCall(FrameworkMethod.java:44)
	at org.junit.internal.runners.model.ReflectiveCallable.run(ReflectiveCallable.java:15)
	at org.junit.runners.model.FrameworkMethod.invokeExplosively(FrameworkMethod.java:41)
	at org.junit.internal.runners.statements.InvokeMethod.evaluate(InvokeMethod.java:20)
	at org.junit.runners.BlockJUnit4ClassRunner.runChild(BlockJUnit4ClassRunner.java:76)
	at org.junit.runners.BlockJUnit4ClassRunner.runChild(BlockJUnit4ClassRunner.java:50)
	at org.junit.runners.ParentRunner$3.run(ParentRunner.java:193)
	at org.junit.runners.ParentRunner$1.schedule(ParentRunner.java:52)
	at org.junit.runners.ParentRunner.runChildren(ParentRunner.java:191)
	at org.junit.runners.ParentRunner.access$000(ParentRunner.java:42)
	at org.junit.runners.ParentRunner$2.evaluate(ParentRunner.java:184)
	at org.junit.runners.ParentRunner.run(ParentRunner.java:236)
	at org.apache.maven.surefire.junit4.JUnit4TestSet.execute(JUnit4TestSet.java:62)
	at org.apache.maven.surefire.suite.AbstractDirectoryTestSuite.executeTestSet(AbstractDirectoryTestSuite.java:140)
	at org.apache.maven.surefire.suite.AbstractDirectoryTestSuite.execute(AbstractDirectoryTestSuite.java:127)
	at org.apache.maven.surefire.Surefire.run(Surefire.java:177)
	at sun.reflect.NativeMethodAccessorImpl.invoke0(Native Method)
	at sun.reflect.NativeMethodAccessorImpl.invoke(NativeMethodAccessorImpl.java:39)
	at sun.reflect.DelegatingMethodAccessorImpl.invoke(DelegatingMethodAccessorImpl.java:25)
	at java.lang.reflect.Method.invoke(Method.java:597)
	at org.apache.maven.surefire.booter.SurefireBooter.runSuitesInProcess(SurefireBooter.java:345)
	at org.apache.maven.surefire.booter.SurefireBooter.main(SurefireBooter.java:1009)
Tests run: 1, Failures: 0, Errors: 0, Skipped: 0, Time elapsed: 25.029 sec
Running org.apache.mina.session.AbstractIoSessionTest
Tests run: 3, Failures: 0, Errors: 3, Skipped: 0, Time elapsed: 0.01 sec <<< FAILURE!

Results :

Tests in error: 
  initializationError(org.apache.mina.filterchain.DefaultIoFilterChainTest)
  testGetId(org.apache.mina.session.AbstractIoSessionTest)
  testCreationTime(org.apache.mina.session.AbstractIoSessionTest)
  testAttachment(org.apache.mina.session.AbstractIoSessionTest)

Tests run: 20, Failures: 0, Errors: 4, Skipped: 0

[ERROR] There are test failures.

Please refer to <https://builds.apache.org/job/MINA-trunk-jdk1.6-ubuntu/ws/trunk/core/target/surefire-reports>
for the individual test results.
[JENKINS] Recording test results
log4j:WARN No appenders could be found for logger (org.apache.commons.beanutils.converters.BooleanConverter).
log4j:WARN Please initialize the log4j system properly.
[INFO] [bundle:bundle {execution: default-bundle}]
[INFO] Preparing source:jar
[WARNING] Removing: jar from forked lifecycle, to prevent recursive invocation.
[INFO] No goals needed for project - skipping
[INFO] [source:jar {execution: attach-source}]
[INFO] Building jar: <https://builds.apache.org/job/MINA-trunk-jdk1.6-ubuntu/ws/trunk/core/target/mina-core-3.0.0-M1-SNAPSHOT-sources.jar>
[INFO] [install:install {execution: default-install}]
[INFO] Installing <https://builds.apache.org/job/MINA-trunk-jdk1.6-ubuntu/ws/trunk/core/target/mina-core-3.0.0-M1-SNAPSHOT.jar>
to /home/jenkins/.m2/repository/org/apache/mina/mina-core/3.0.0-M1-SNAPSHOT/mina-core-3.0.0-M1-SNAPSHOT.jar
[INFO] Installing <https://builds.apache.org/job/MINA-trunk-jdk1.6-ubuntu/ws/trunk/core/target/mina-core-3.0.0-M1-SNAPSHOT-sources.jar>
to /home/jenkins/.m2/repository/org/apache/mina/mina-core/3.0.0-M1-SNAPSHOT/mina-core-3.0.0-M1-SNAPSHOT-sources.jar
[INFO] [bundle:install {execution: default-install}]
[INFO] Parsing file:/home/jenkins/.m2/repository/repository.xml
[INFO] Installing org/apache/mina/mina-core/3.0.0-M1-SNAPSHOT/mina-core-3.0.0-M1-SNAPSHOT.jar
[INFO] Writing OBR metadata
[JENKINS] Archiving <https://builds.apache.org/job/MINA-trunk-jdk1.6-ubuntu/ws/trunk/core/pom.xml>
to /home/hudson/hudson/jobs/MINA-trunk-jdk1.6-ubuntu/modules/org.apache.mina$mina-core/builds/2011-09-17_05-56-23/archive/org.apache.mina/mina-core/3.0.0-M1-SNAPSHOT/mina-core-3.0.0-M1-SNAPSHOT.pom
[JENKINS] Archiving <https://builds.apache.org/job/MINA-trunk-jdk1.6-ubuntu/ws/trunk/core/target/mina-core-3.0.0-M1-SNAPSHOT.jar>
to /home/hudson/hudson/jobs/MINA-trunk-jdk1.6-ubuntu/modules/org.apache.mina$mina-core/builds/2011-09-17_05-56-23/archive/org.apache.mina/mina-core/3.0.0-M1-SNAPSHOT/mina-core-3.0.0-M1-SNAPSHOT.jar
[JENKINS] Archiving <https://builds.apache.org/job/MINA-trunk-jdk1.6-ubuntu/ws/trunk/core/target/mina-core-3.0.0-M1-SNAPSHOT-sources.jar>
to /home/hudson/hudson/jobs/MINA-trunk-jdk1.6-ubuntu/modules/org.apache.mina$mina-core/builds/2011-09-17_05-56-23/archive/org.apache.mina/mina-core/3.0.0-M1-SNAPSHOT/mina-core-3.0.0-M1-SNAPSHOT-sources.jar
[INFO] ------------------------------------------------------------------------
[INFO] Building Apache MINA HTTP
[INFO]    task-segment: [clean, install]
[INFO] ------------------------------------------------------------------------
[INFO] [clean:clean {execution: default-clean}]
[INFO] [resources:resources {execution: default-resources}]
[WARNING] Using platform encoding (ANSI_X3.4-1968 actually) to copy filtered resources, i.e.
build is platform dependent!
[INFO] skip non existing resourceDirectory <https://builds.apache.org/job/MINA-trunk-jdk1.6-ubuntu/ws/trunk/http/src/main/resources>
[INFO] [compiler:compile {execution: default-compile}]
[INFO] Compiling 16 source files to <https://builds.apache.org/job/MINA-trunk-jdk1.6-ubuntu/ws/trunk/http/target/classes>
[JENKINS] Archiving <https://builds.apache.org/job/MINA-trunk-jdk1.6-ubuntu/ws/trunk/http/pom.xml>
to /home/hudson/hudson/jobs/MINA-trunk-jdk1.6-ubuntu/modules/org.apache.mina$mina-http/builds/2011-09-17_05-56-23/archive/org.apache.mina/mina-http/3.0.0-M1-SNAPSHOT/mina-http-3.0.0-M1-SNAPSHOT.pom
[INFO] ------------------------------------------------------------------------
[ERROR] BUILD FAILURE
[INFO] ------------------------------------------------------------------------
[INFO] Compilation failure
<https://builds.apache.org/job/MINA-trunk-jdk1.6-ubuntu/ws/trunk/http/src/main/java/org/apache/mina/http/HttpServerCodec.java>:[131,48]
type parameters of <T>T cannot be determined; no unique maximal instance exists for
type variable T with upper bounds int,java.lang.Object


[INFO] ------------------------------------------------------------------------
[INFO] For more information, run Maven with the -e switch
[INFO] ------------------------------------------------------------------------
[INFO] Total time: 1 minute 6 seconds
[INFO] Finished at: Sat Sep 17 05:58:02 UTC 2011
[INFO] Final Memory: 34M/311M
[INFO] ------------------------------------------------------------------------
Sending e-mails to: commits@mina.apache.org
channel stopped


Mime
View raw message