mina-commits mailing list archives

Site index · List index
Message view « Date » · « Thread »
Top « Date » · « Thread »
From Apache Jenkins Server <jenk...@builds.apache.org>
Subject Build failed in Jenkins: vysper-trunk-jdk1.5-ibm-ubuntu #374
Date Mon, 04 Jul 2011 21:29:55 GMT
See <https://builds.apache.org/job/vysper-trunk-jdk1.5-ibm-ubuntu/374/changes>

Changes:

[ngn] Only announce in-band registrations on encrypted connections.  (VYSPER-288)

[ngn] Only announce in-band registrations on encrypted connections.  (VYSPER-288)

[ngn] Only announce in-band registrations on encrypted connections

[ngn] Adding configuration for keystore type (VYSPER-291)

------------------------------------------
[...truncated 2926 lines...]
org.apache.vysper.xmpp.modules.extension.xep0045_muc.handler.MUCMessageHandler DEBUG Received
message for MUC
org.apache.vysper.xmpp.modules.extension.xep0045_muc.handler.MUCMessageHandler DEBUG Received
direct message to room1@chat.test
Tests run: 7, Failures: 0, Errors: 0, Skipped: 0, Time elapsed: 0.006 sec
Running org.apache.vysper.xmpp.modules.extension.xep0045_muc.handler.RevokeMembershipTestCase
org.apache.vysper.xmpp.protocol.SessionStateHolder DEBUG session state changed to = AUTHENTICATED
org.apache.vysper.xmpp.modules.extension.xep0045_muc.handler.MUCIqAdminHandler DEBUG Received
MUC admin stanza
org.apache.vysper.xmpp.modules.extension.xep0045_muc.handler.MUCIqAdminHandler DEBUG Changing
affiliation
org.apache.vysper.xmpp.protocol.SessionStateHolder DEBUG session state changed to = AUTHENTICATED
org.apache.vysper.xmpp.modules.extension.xep0045_muc.handler.MUCIqAdminHandler DEBUG Received
MUC admin stanza
org.apache.vysper.xmpp.modules.extension.xep0045_muc.handler.MUCIqAdminHandler DEBUG Changing
affiliation
org.apache.vysper.xmpp.protocol.SessionStateHolder DEBUG session state changed to = AUTHENTICATED
org.apache.vysper.xmpp.modules.extension.xep0045_muc.handler.MUCIqAdminHandler DEBUG Received
MUC admin stanza
org.apache.vysper.xmpp.modules.extension.xep0045_muc.handler.MUCIqAdminHandler DEBUG Changing
affiliation
Tests run: 3, Failures: 0, Errors: 0, Skipped: 0, Time elapsed: 0.003 sec
Running org.apache.vysper.xmpp.modules.extension.xep0045_muc.MUCRoomInfoDiscoTestCase
org.apache.vysper.xmpp.modules.extension.xep0045_muc.MUCModule WARN No room storage provider
found, using the default (in memory)
org.apache.vysper.xmpp.modules.extension.xep0045_muc.MUCModule WARN No occupant storage provider
found, using the default (in memory)
Tests run: 1, Failures: 0, Errors: 0, Skipped: 0, Time elapsed: 0.003 sec
Running org.apache.vysper.xmpp.modules.extension.xep0045_muc.stanzas.XTestCase
Tests run: 1, Failures: 0, Errors: 0, Skipped: 0, Time elapsed: 0.001 sec
Running org.apache.vysper.xmpp.modules.extension.xep0045_muc.MUCOccupantInfoDiscoTestCase
org.apache.vysper.xmpp.protocol.SessionStateHolder DEBUG session state changed to = AUTHENTICATED
org.apache.vysper.xmpp.modules.extension.xep0045_muc.MUCModule WARN No room storage provider
found, using the default (in memory)
org.apache.vysper.xmpp.modules.extension.xep0045_muc.MUCModule WARN No occupant storage provider
found, using the default (in memory)
Tests run: 1, Failures: 0, Errors: 0, Skipped: 0, Time elapsed: 0.001 sec
Running org.apache.vysper.xmpp.modules.extension.xep0045_muc.MUCComponentInfoDiscoTestCase
org.apache.vysper.xmpp.modules.extension.xep0045_muc.MUCModule WARN No room storage provider
found, using the default (in memory)
org.apache.vysper.xmpp.modules.extension.xep0045_muc.MUCModule WARN No occupant storage provider
found, using the default (in memory)
Tests run: 1, Failures: 0, Errors: 0, Skipped: 0, Time elapsed: 0.001 sec

Results :

Tests run: 122, Failures: 0, Errors: 0, Skipped: 0

[JENKINS] Recording test results
[INFO] [jar:jar {execution: default-jar}]
[INFO] Building jar: <https://builds.apache.org/job/vysper-trunk-jdk1.5-ibm-ubuntu/ws/trunk/server/extensions/xep0045-muc/target/xep0045-muc-0.7-SNAPSHOT.jar>
[INFO] [install:install {execution: default-install}]
[INFO] Installing <https://builds.apache.org/job/vysper-trunk-jdk1.5-ibm-ubuntu/ws/trunk/server/extensions/xep0045-muc/target/xep0045-muc-0.7-SNAPSHOT.jar>
to /home/hudson/.m2/repository/org/apache/vysper/extensions/xep0045-muc/0.7-SNAPSHOT/xep0045-muc-0.7-SNAPSHOT.jar
[JENKINS] Archiving <https://builds.apache.org/job/vysper-trunk-jdk1.5-ibm-ubuntu/ws/trunk/server/extensions/xep0045-muc/pom.xml>
to /home/hudson/hudson/jobs/vysper-trunk-jdk1.5-ibm-ubuntu/modules/org.apache.vysper.extensions$xep0045-muc/builds/2011-07-04_21-27-58/archive/org.apache.vysper.extensions/xep0045-muc/0.7-SNAPSHOT/xep0045-muc-0.7-SNAPSHOT.pom
[JENKINS] Archiving <https://builds.apache.org/job/vysper-trunk-jdk1.5-ibm-ubuntu/ws/trunk/server/extensions/xep0045-muc/target/xep0045-muc-0.7-SNAPSHOT.jar>
to /home/hudson/hudson/jobs/vysper-trunk-jdk1.5-ibm-ubuntu/modules/org.apache.vysper.extensions$xep0045-muc/builds/2011-07-04_21-27-58/archive/org.apache.vysper.extensions/xep0045-muc/0.7-SNAPSHOT/xep0045-muc-0.7-SNAPSHOT.jar
[INFO] ------------------------------------------------------------------------
[INFO] Building Apache Vysper XEP-0065 SOCKS5 Bytestreams
[INFO]    task-segment: [clean, install]
[INFO] ------------------------------------------------------------------------
[INFO] [clean:clean {execution: default-clean}]
[INFO] [remote-resources:process {execution: default}]
[INFO] [resources:resources {execution: default-resources}]
[INFO] Using 'UTF-8' encoding to copy filtered resources.
[INFO] Copying 0 resource
[INFO] Copying 2 resources
[INFO] [compiler:compile {execution: default-compile}]
[INFO] Compiling 6 source files to <https://builds.apache.org/job/vysper-trunk-jdk1.5-ibm-ubuntu/ws/trunk/server/extensions/xep0065-socks/target/classes>
[INFO] [resources:testResources {execution: default-testResources}]
[INFO] Using 'UTF-8' encoding to copy filtered resources.
[INFO] Copying 2 resources
[INFO] Copying 2 resources
[INFO] [compiler:testCompile {execution: default-testCompile}]
[INFO] Compiling 9 source files to <https://builds.apache.org/job/vysper-trunk-jdk1.5-ibm-ubuntu/ws/trunk/server/extensions/xep0065-socks/target/test-classes>
[INFO] [surefire:test {execution: default-test}]
[INFO] Surefire report directory: <https://builds.apache.org/job/vysper-trunk-jdk1.5-ibm-ubuntu/ws/trunk/server/extensions/xep0065-socks/target/surefire-reports>
/home/hudson/tools/java/ibm-java2-x86_64-50/jre/bin/java: Symbol `com_ibm_oti_vm_VM_getStackClassLoader'
causes overflow in R_X86_64_PC32 relocation
/home/hudson/tools/java/ibm-java2-x86_64-50/jre/bin/java: Symbol `com_ibm_oti_vm_VM_getStackClass'
causes overflow in R_X86_64_PC32 relocation
/home/hudson/tools/java/ibm-java2-x86_64-50/jre/bin/java: Symbol `com_ibm_oti_vm_VM_getStackClass'
causes overflow in R_X86_64_PC32 relocation

-------------------------------------------------------
 T E S T S
-------------------------------------------------------
Running org.apache.vysper.xmpp.extension.xep0065_socks.DefaultSocks5ConnectionsRegistryTest
Tests run: 7, Failures: 0, Errors: 0, Skipped: 0, Time elapsed: 0.296 sec
Running org.apache.vysper.xmpp.extension.xep0065_socks.Socks5IqHandlerTest
Tests run: 14, Failures: 0, Errors: 0, Skipped: 0, Time elapsed: 1 sec
Running org.apache.vysper.xmpp.extension.xep0065_socks.Socks5PairTest
Tests run: 5, Failures: 0, Errors: 0, Skipped: 0, Time elapsed: 0.007 sec
Running org.apache.vysper.xmpp.extension.xep0065_socks.Socks5IntegrationTest
Tests run: 1, Failures: 0, Errors: 0, Skipped: 1, Time elapsed: 0 sec
Running org.apache.vysper.xmpp.extension.xep0065_socks.OpeningPackageTest
Tests run: 7, Failures: 0, Errors: 0, Skipped: 0, Time elapsed: 0.016 sec
Running org.apache.vysper.xmpp.extension.xep0065_socks.Socks5AcceptorHandlerTest
SOCKS5 session opened
SOCKS5 session initiated
SOCKS5 session closed
SOCKS5 session closed
SOCKS5 session closed
SOCKS5 connection idle, will be closed
Exception caused in SOCKS5 proxy, probably a bug in Vysper
java.lang.Exception
	at org.apache.vysper.xmpp.extension.xep0065_socks.Socks5AcceptorHandlerTest.exceptionCaughtPairEstablished(Socks5AcceptorHandlerTest.java:165)
	at sun.reflect.NativeMethodAccessorImpl.invoke0(Native Method)
	at sun.reflect.NativeMethodAccessorImpl.invoke(NativeMethodAccessorImpl.java:79)
	at sun.reflect.DelegatingMethodAccessorImpl.invoke(DelegatingMethodAccessorImpl.java:43)
	at java.lang.reflect.Method.invoke(Method.java:618)
	at org.junit.runners.model.FrameworkMethod$1.runReflectiveCall(FrameworkMethod.java:44)
	at org.junit.internal.runners.model.ReflectiveCallable.run(ReflectiveCallable.java:15)
	at org.junit.runners.model.FrameworkMethod.invokeExplosively(FrameworkMethod.java:41)
	at org.junit.internal.runners.statements.InvokeMethod.evaluate(InvokeMethod.java:20)
	at org.junit.internal.runners.statements.RunBefores.evaluate(RunBefores.java:28)
	at org.junit.runners.BlockJUnit4ClassRunner.runNotIgnored(BlockJUnit4ClassRunner.java:79)
	at org.junit.runners.BlockJUnit4ClassRunner.runChild(BlockJUnit4ClassRunner.java:71)
	at org.junit.runners.BlockJUnit4ClassRunner.runChild(BlockJUnit4ClassRunner.java:49)
	at org.junit.runners.ParentRunner$3.run(ParentRunner.java:193)
	at org.junit.runners.ParentRunner$1.schedule(ParentRunner.java:52)
	at org.junit.runners.ParentRunner.runChildren(ParentRunner.java:191)
	at org.junit.runners.ParentRunner.access$000(ParentRunner.java:42)
	at org.junit.runners.ParentRunner$2.evaluate(ParentRunner.java:184)
	at org.junit.runners.ParentRunner.run(ParentRunner.java:236)
	at org.apache.maven.surefire.junit4.JUnit4TestSet.execute(JUnit4TestSet.java:35)
	at org.apache.maven.surefire.junit4.JUnit4Provider.executeTestSet(JUnit4Provider.java:146)
	at org.apache.maven.surefire.junit4.JUnit4Provider.invoke(JUnit4Provider.java:97)
	at sun.reflect.NativeMethodAccessorImpl.invoke0(Native Method)
	at sun.reflect.NativeMethodAccessorImpl.invoke(NativeMethodAccessorImpl.java:79)
	at sun.reflect.DelegatingMethodAccessorImpl.invoke(DelegatingMethodAccessorImpl.java:43)
	at java.lang.reflect.Method.invoke(Method.java:618)
	at org.apache.maven.surefire.booter.ProviderFactory$ClassLoaderProxy.invoke(ProviderFactory.java:103)
	at $Proxy0.invoke(Unknown Source)
	at org.apache.maven.surefire.booter.SurefireStarter.invokeProvider(SurefireStarter.java:145)
	at org.apache.maven.surefire.booter.SurefireStarter.runSuitesInProcess(SurefireStarter.java:87)
	at org.apache.maven.surefire.booter.ForkedBooter.main(ForkedBooter.java:69)
Exception caused in SOCKS5 proxy, probably a bug in Vysper
java.lang.Exception
	at org.apache.vysper.xmpp.extension.xep0065_socks.Socks5AcceptorHandlerTest.exceptionCaughtPairNotEstablished(Socks5AcceptorHandlerTest.java:173)
	at sun.reflect.NativeMethodAccessorImpl.invoke0(Native Method)
	at sun.reflect.NativeMethodAccessorImpl.invoke(NativeMethodAccessorImpl.java:79)
	at sun.reflect.DelegatingMethodAccessorImpl.invoke(DelegatingMethodAccessorImpl.java:43)
	at java.lang.reflect.Method.invoke(Method.java:618)
	at org.junit.runners.model.FrameworkMethod$1.runReflectiveCall(FrameworkMethod.java:44)
	at org.junit.internal.runners.model.ReflectiveCallable.run(ReflectiveCallable.java:15)
	at org.junit.runners.model.FrameworkMethod.invokeExplosively(FrameworkMethod.java:41)
	at org.junit.internal.runners.statements.InvokeMethod.evaluate(InvokeMethod.java:20)
	at org.junit.internal.runners.statements.RunBefores.evaluate(RunBefores.java:28)
	at org.junit.runners.BlockJUnit4ClassRunner.runNotIgnored(BlockJUnit4ClassRunner.java:79)
	at org.junit.runners.BlockJUnit4ClassRunner.runChild(BlockJUnit4ClassRunner.java:71)
	at org.junit.runners.BlockJUnit4ClassRunner.runChild(BlockJUnit4ClassRunner.java:49)
	at org.junit.runners.ParentRunner$3.run(ParentRunner.java:193)
	at org.junit.runners.ParentRunner$1.schedule(ParentRunner.java:52)
	at org.junit.runners.ParentRunner.runChildren(ParentRunner.java:191)
	at org.junit.runners.ParentRunner.access$000(ParentRunner.java:42)
	at org.junit.runners.ParentRunner$2.evaluate(ParentRunner.java:184)
	at org.junit.runners.ParentRunner.run(ParentRunner.java:236)
	at org.apache.maven.surefire.junit4.JUnit4TestSet.execute(JUnit4TestSet.java:35)
	at org.apache.maven.surefire.junit4.JUnit4Provider.executeTestSet(JUnit4Provider.java:146)
	at org.apache.maven.surefire.junit4.JUnit4Provider.invoke(JUnit4Provider.java:97)
	at sun.reflect.NativeMethodAccessorImpl.invoke0(Native Method)
	at sun.reflect.NativeMethodAccessorImpl.invoke(NativeMethodAccessorImpl.java:79)
	at sun.reflect.DelegatingMethodAccessorImpl.invoke(DelegatingMethodAccessorImpl.java:43)
	at java.lang.reflect.Method.invoke(Method.java:618)
	at org.apache.maven.surefire.booter.ProviderFactory$ClassLoaderProxy.invoke(ProviderFactory.java:103)
	at $Proxy0.invoke(Unknown Source)
	at org.apache.maven.surefire.booter.SurefireStarter.invokeProvider(SurefireStarter.java:145)
	at org.apache.maven.surefire.booter.SurefireStarter.runSuitesInProcess(SurefireStarter.java:87)
	at org.apache.maven.surefire.booter.ForkedBooter.main(ForkedBooter.java:69)
SOCKS5 connection closed
Tests run: 12, Failures: 0, Errors: 0, Skipped: 0, Time elapsed: 0.031 sec
Running org.apache.vysper.xmpp.extension.xep0065_socks.InitiatingPacketTest
Tests run: 8, Failures: 0, Errors: 0, Skipped: 0, Time elapsed: 0.004 sec
Running org.apache.vysper.xmpp.extension.xep0065_socks.Socks5ModuleTest
cannot register disco request listeners: no registry service found
cannot register disco request listeners: no registry service found
SOCKS5 session opened
cannot register disco request listeners: no registry service found
SOCKS5 connection closed
SOCKS5 session opened
SOCKS5 connection closed
cannot register disco request listeners: no registry service found
Tests run: 12, Failures: 0, Errors: 0, Skipped: 0, Time elapsed: 0.529 sec

Results :

Tests run: 66, Failures: 0, Errors: 0, Skipped: 1

[JENKINS] Recording test results
[INFO] [jar:jar {execution: default-jar}]
[INFO] Building jar: <https://builds.apache.org/job/vysper-trunk-jdk1.5-ibm-ubuntu/ws/trunk/server/extensions/xep0065-socks/target/xep0065-socks-0.7-SNAPSHOT.jar>
[INFO] [install:install {execution: default-install}]
[INFO] Installing <https://builds.apache.org/job/vysper-trunk-jdk1.5-ibm-ubuntu/ws/trunk/server/extensions/xep0065-socks/target/xep0065-socks-0.7-SNAPSHOT.jar>
to /home/hudson/.m2/repository/org/apache/vysper/extensions/xep0065-socks/0.7-SNAPSHOT/xep0065-socks-0.7-SNAPSHOT.jar
[JENKINS] Archiving <https://builds.apache.org/job/vysper-trunk-jdk1.5-ibm-ubuntu/ws/trunk/server/extensions/xep0065-socks/pom.xml>
to /home/hudson/hudson/jobs/vysper-trunk-jdk1.5-ibm-ubuntu/modules/org.apache.vysper.extensions$xep0065-socks/builds/2011-07-04_21-27-58/archive/org.apache.vysper.extensions/xep0065-socks/0.7-SNAPSHOT/xep0065-socks-0.7-SNAPSHOT.pom
[JENKINS] Archiving <https://builds.apache.org/job/vysper-trunk-jdk1.5-ibm-ubuntu/ws/trunk/server/extensions/xep0065-socks/target/xep0065-socks-0.7-SNAPSHOT.jar>
to /home/hudson/hudson/jobs/vysper-trunk-jdk1.5-ibm-ubuntu/modules/org.apache.vysper.extensions$xep0065-socks/builds/2011-07-04_21-27-58/archive/org.apache.vysper.extensions/xep0065-socks/0.7-SNAPSHOT/xep0065-socks-0.7-SNAPSHOT.jar
[INFO] ------------------------------------------------------------------------
[INFO] Building Apache Vysper XEP-0124 and XEP-0206 BOSH
[INFO]    task-segment: [clean, install]
[INFO] ------------------------------------------------------------------------
[INFO] [clean:clean {execution: default-clean}]
[INFO] [remote-resources:process {execution: default}]
[INFO] [resources:resources {execution: default-resources}]
[INFO] Using 'UTF-8' encoding to copy filtered resources.
[INFO] Copying 2 resources
[INFO] Copying 2 resources
[INFO] [compiler:compile {execution: default-compile}]
[INFO] Compiling 11 source files to <https://builds.apache.org/job/vysper-trunk-jdk1.5-ibm-ubuntu/ws/trunk/server/extensions/xep0124-xep0206-bosh/target/classes>
[JENKINS] Archiving <https://builds.apache.org/job/vysper-trunk-jdk1.5-ibm-ubuntu/ws/trunk/server/extensions/xep0124-xep0206-bosh/pom.xml>
to /home/hudson/hudson/jobs/vysper-trunk-jdk1.5-ibm-ubuntu/modules/org.apache.vysper.extensions$xep0124-xep0206-bosh/builds/2011-07-04_21-27-58/archive/org.apache.vysper.extensions/xep0124-xep0206-bosh/0.7-SNAPSHOT/xep0124-xep0206-bosh-0.7-SNAPSHOT.pom
[INFO] ------------------------------------------------------------------------
[ERROR] BUILD FAILURE
[INFO] ------------------------------------------------------------------------
[INFO] Compilation failure
<https://builds.apache.org/job/vysper-trunk-jdk1.5-ibm-ubuntu/ws/trunk/server/extensions/xep0124-xep0206-bosh/src/main/java/org/apache/vysper/xmpp/extension/xep0124/BoshHandler.java>:[226,26]
getFeaturesForAuthentication(java.util.List<org.apache.vysper.xmpp.authentication.SASLMechanism>,org.apache.vysper.xmpp.server.SessionContext)
in org.apache.vysper.xmpp.server.response.ServerResponses cannot be applied to (java.util.List<org.apache.vysper.xmpp.authentication.SASLMechanism>)


[INFO] ------------------------------------------------------------------------
[INFO] Trace
org.apache.maven.BuildFailureException: Compilation failure
<https://builds.apache.org/job/vysper-trunk-jdk1.5-ibm-ubuntu/ws/trunk/server/extensions/xep0124-xep0206-bosh/src/main/java/org/apache/vysper/xmpp/extension/xep0124/BoshHandler.java>:[226,26]
getFeaturesForAuthentication(java.util.List<org.apache.vysper.xmpp.authentication.SASLMechanism>,org.apache.vysper.xmpp.server.SessionContext)
in org.apache.vysper.xmpp.server.response.ServerResponses cannot be applied to (java.util.List<org.apache.vysper.xmpp.authentication.SASLMechanism>)


	at org.apache.maven.lifecycle.DefaultLifecycleExecutor.executeGoals(DefaultLifecycleExecutor.java:715)
	at org.apache.maven.lifecycle.DefaultLifecycleExecutor.executeGoalWithLifecycle(DefaultLifecycleExecutor.java:556)
	at org.apache.maven.lifecycle.DefaultLifecycleExecutor.executeGoal(DefaultLifecycleExecutor.java:535)
	at org.apache.maven.lifecycle.DefaultLifecycleExecutor.executeGoalAndHandleFailures(DefaultLifecycleExecutor.java:387)
	at org.apache.maven.lifecycle.DefaultLifecycleExecutor.executeTaskSegments(DefaultLifecycleExecutor.java:348)
	at org.apache.maven.lifecycle.DefaultLifecycleExecutor.execute(DefaultLifecycleExecutor.java:180)
	at org.apache.maven.lifecycle.LifecycleExecutorInterceptor.execute(LifecycleExecutorInterceptor.java:65)
	at org.apache.maven.DefaultMaven.doExecute(DefaultMaven.java:328)
	at org.apache.maven.DefaultMaven.execute(DefaultMaven.java:138)
	at org.apache.maven.cli.MavenCli.main(MavenCli.java:362)
	at sun.reflect.NativeMethodAccessorImpl.invoke0(Native Method)
	at sun.reflect.NativeMethodAccessorImpl.invoke(NativeMethodAccessorImpl.java:79)
	at sun.reflect.DelegatingMethodAccessorImpl.invoke(DelegatingMethodAccessorImpl.java:43)
	at java.lang.reflect.Method.invoke(Method.java:618)
	at org.codehaus.classworlds.Launcher.launchEnhanced(Launcher.java:315)
	at org.codehaus.classworlds.Launcher.launch(Launcher.java:255)
	at hudson.maven.agent.Main.launch(Main.java:185)
	at hudson.maven.MavenBuilder.call(MavenBuilder.java:164)
	at hudson.maven.MavenModuleSetBuild$Builder.call(MavenModuleSetBuild.java:987)
	at hudson.maven.MavenModuleSetBuild$Builder.call(MavenModuleSetBuild.java:918)
	at hudson.remoting.UserRequest.perform(UserRequest.java:118)
	at hudson.remoting.UserRequest.perform(UserRequest.java:48)
	at hudson.remoting.Request$2.run(Request.java:270)
	at java.util.concurrent.Executors$RunnableAdapter.call(Executors.java:432)
	at java.util.concurrent.FutureTask$Sync.innerRun(FutureTask.java:284)
	at java.util.concurrent.FutureTask.run(FutureTask.java:138)
	at java.util.concurrent.ThreadPoolExecutor$Worker.runTask(ThreadPoolExecutor.java:665)
	at java.util.concurrent.ThreadPoolExecutor$Worker.run(ThreadPoolExecutor.java:690)
	at java.lang.Thread.run(Thread.java:810)
Caused by: org.apache.maven.plugin.CompilationFailureException: Compilation failure
<https://builds.apache.org/job/vysper-trunk-jdk1.5-ibm-ubuntu/ws/trunk/server/extensions/xep0124-xep0206-bosh/src/main/java/org/apache/vysper/xmpp/extension/xep0124/BoshHandler.java>:[226,26]
getFeaturesForAuthentication(java.util.List<org.apache.vysper.xmpp.authentication.SASLMechanism>,org.apache.vysper.xmpp.server.SessionContext)
in org.apache.vysper.xmpp.server.response.ServerResponses cannot be applied to (java.util.List<org.apache.vysper.xmpp.authentication.SASLMechanism>)


	at org.apache.maven.plugin.AbstractCompilerMojo.execute(AbstractCompilerMojo.java:516)
	at org.apache.maven.plugin.CompilerMojo.execute(CompilerMojo.java:114)
	at org.apache.maven.plugin.DefaultPluginManager.executeMojo(DefaultPluginManager.java:490)
	at hudson.maven.agent.PluginManagerInterceptor.executeMojo(PluginManagerInterceptor.java:182)
	at org.apache.maven.lifecycle.DefaultLifecycleExecutor.executeGoals(DefaultLifecycleExecutor.java:694)
	... 28 more
[INFO] ------------------------------------------------------------------------
[INFO] Total time: 1 minute 18 seconds
[INFO] Finished at: Mon Jul 04 21:29:50 UTC 2011
[INFO] Final Memory: 57M/137M
[INFO] ------------------------------------------------------------------------
Sending e-mails to: commits@mina.apache.org
channel stopped


Mime
View raw message