mina-commits mailing list archives

Site index · List index
Message view « Date » · « Thread »
Top « Date » · « Thread »
From Apache Hudson Server <hud...@hudson.apache.org>
Subject Build failed in Hudson: vysper-trunk-harmony1.5-ubuntu » Apache Vysper Core #132
Date Tue, 04 Jan 2011 01:09:47 GMT
See <https://hudson.apache.org/hudson/job/vysper-trunk-harmony1.5-ubuntu/org.apache.vysper$vysper-core/132/changes>

Changes:

[ngn] Merge in s2s branch, all fingers crossed

------------------------------------------
[...truncated 4 lines...]
[INFO] [clean:clean {execution: default-clean}]
[INFO] Deleting file set: <https://hudson.apache.org/hudson/job/vysper-trunk-harmony1.5-ubuntu/org.apache.vysper$vysper-core/ws/target>
(included: [**], excluded: [])
[INFO] [remote-resources:process {execution: default}]
[INFO] snapshot org.apache.vysper:nbxml:0.7-SNAPSHOT: checking for updates from apache.snapshots
[INFO] snapshot org.apache.vysper:spec-compliance:0.7-SNAPSHOT: checking for updates from
apache.snapshots
[INFO] [properties:write-project-properties {execution: default}]
[INFO] [resources:resources {execution: default-resources}]
[INFO] Using 'UTF-8' encoding to copy filtered resources.
[INFO] Copying 0 resource
[INFO] Copying 2 resources
[INFO] [compiler:compile {execution: default-compile}]
[INFO] Compiling 272 source files to <https://hudson.apache.org/hudson/job/vysper-trunk-harmony1.5-ubuntu/org.apache.vysper$vysper-core/ws/target/classes>
[INFO] [resources:testResources {execution: default-testResources}]
[INFO] Using 'UTF-8' encoding to copy filtered resources.
[INFO] Copying 2 resources
[INFO] Copying 2 resources
[INFO] [compiler:testCompile {execution: default-testCompile}]
[INFO] Compiling 57 source files to <https://hudson.apache.org/hudson/job/vysper-trunk-harmony1.5-ubuntu/org.apache.vysper$vysper-core/ws/target/test-classes>
[HUDSON] Archiving <https://hudson.apache.org/hudson/job/vysper-trunk-harmony1.5-ubuntu/org.apache.vysper$vysper-core/ws/pom.xml>
to /home/hudson/hudson/jobs/vysper-trunk-harmony1.5-ubuntu/modules/org.apache.vysper$vysper-core/builds/2011-01-04_01-08-50/archive/org.apache.vysper/vysper-core/0.7-SNAPSHOT/pom.xml
[INFO] ------------------------------------------------------------------------
[ERROR] BUILD FAILURE
[INFO] ------------------------------------------------------------------------
[INFO] Compilation failure

no more tokens - could not parse error message: ----------
1. ERROR in <https://hudson.apache.org/hudson/job/vysper-trunk-harmony1.5-ubuntu/org.apache.vysper$vysper-core/ws/src/test/java/org/apache/vysper/xmpp/delivery/inbound/TestExecutorService.java>
(at line 16)
	public class TestExecutorService implements ExecutorService {
	             ^^^^^^^^^^^^^^^^^^^

no more tokens - could not parse error message: The type TestExecutorService must implement
the inherited abstract method ExecutorService.invokeAll(Collection<Callable<T>>,
long, TimeUnit)
----------
2. ERROR in <https://hudson.apache.org/hudson/job/vysper-trunk-harmony1.5-ubuntu/org.apache.vysper$vysper-core/ws/src/test/java/org/apache/vysper/xmpp/delivery/inbound/TestExecutorService.java>
(at line 16)
	public class TestExecutorService implements ExecutorService {
	             ^^^^^^^^^^^^^^^^^^^

no more tokens - could not parse error message: The type TestExecutorService must implement
the inherited abstract method ExecutorService.invokeAny(Collection<Callable<T>>,
long, TimeUnit)
----------
3. ERROR in <https://hudson.apache.org/hudson/job/vysper-trunk-harmony1.5-ubuntu/org.apache.vysper$vysper-core/ws/src/test/java/org/apache/vysper/xmpp/delivery/inbound/TestExecutorService.java>
(at line 16)
	public class TestExecutorService implements ExecutorService {
	             ^^^^^^^^^^^^^^^^^^^

no more tokens - could not parse error message: The type TestExecutorService must implement
the inherited abstract method ExecutorService.invokeAll(Collection<Callable<T>>)
----------
4. ERROR in <https://hudson.apache.org/hudson/job/vysper-trunk-harmony1.5-ubuntu/org.apache.vysper$vysper-core/ws/src/test/java/org/apache/vysper/xmpp/delivery/inbound/TestExecutorService.java>
(at line 16)
	public class TestExecutorService implements ExecutorService {
	             ^^^^^^^^^^^^^^^^^^^

no more tokens - could not parse error message: The type TestExecutorService must implement
the inherited abstract method ExecutorService.invokeAny(Collection<Callable<T>>)
----------
5. ERROR in <https://hudson.apache.org/hudson/job/vysper-trunk-harmony1.5-ubuntu/org.apache.vysper$vysper-core/ws/src/test/java/org/apache/vysper/xmpp/delivery/inbound/TestExecutorService.java>
(at line 26)
	public <T> List<Future<T>> invokeAll(Collection<? extends Callable<T>>
tasks) throws InterruptedException {
	                           ^^^^^^^^^^^^^^^^^^^^^^^^^^^^^^^^^^^^^^^^^^^^^^^^^^^^^^^^^^^^^^^^^^^^^^^^^^^^^^

could not parse error message: Name clash: The method invokeAll(Collection<? extends Callable<T>>)
of type TestExecutorService has the same erasure as invokeAll(Collection<Callable<T>>)
of type ExecutorService but does not override it
----------
6. ERROR in <https://hudson.apache.org/hudson/job/vysper-trunk-harmony1.5-ubuntu/org.apache.vysper$vysper-core/ws/src/test/java/org/apache/vysper/xmpp/delivery/inbound/TestExecutorService.java>
(at line 30)
	public <T> List<Future<T>> invokeAll(Collection<? extends Callable<T>>
tasks, long timeout, TimeUnit unit)
            throws InterruptedException {
	                           ^^^^^^^^^^^^^^^^^^^^^^^^^^^^^^^^^^^^^^^^^^^^^^^^^^^^^^^^^^^^^^^^^^^^^^^^^^^^^^^^^^^^^^^^^^^^^^^^^^^^^^^^^^^^^^^^^^^^^^^

could not parse error message: Name clash: The method invokeAll(Collection<? extends Callable<T>>,
long, TimeUnit) of type TestExecutorService has the same erasure as invokeAll(Collection<Callable<T>>,
long, TimeUnit) of type ExecutorService but does not override it
----------
7. ERROR in <https://hudson.apache.org/hudson/job/vysper-trunk-harmony1.5-ubuntu/org.apache.vysper$vysper-core/ws/src/test/java/org/apache/vysper/xmpp/delivery/inbound/TestExecutorService.java>
(at line 35)
	public <T> T invokeAny(Collection<? extends Callable<T>> tasks) throws
InterruptedException, ExecutionException {
	             ^^^^^^^^^^^^^^^^^^^^^^^^^^^^^^^^^^^^^^^^^^^^^^^^^^^^^^^^^^^^^^^^^^^^^^^^^^^^^^^^^^^^^^^^^^^^^^^^^^

could not parse error message: Name clash: The method invokeAny(Collection<? extends Callable<T>>)
of type TestExecutorService has the same erasure as invokeAny(Collection<Callable<T>>)
of type ExecutorService but does not override it
----------
8. ERROR in <https://hudson.apache.org/hudson/job/vysper-trunk-harmony1.5-ubuntu/org.apache.vysper$vysper-core/ws/src/test/java/org/apache/vysper/xmpp/delivery/inbound/TestExecutorService.java>
(at line 39)
	public <T> T invokeAny(Collection<? extends Callable<T>> tasks, long timeout,
TimeUnit unit)
            throws InterruptedException, ExecutionException, TimeoutException {
	             ^^^^^^^^^^^^^^^^^^^^^^^^^^^^^^^^^^^^^^^^^^^^^^^^^^^^^^^^^^^^^^^^^^^^^^^^^^^^^^^^^^^^^^^^^^^^^^^^^^^^^^^^^^^^^^^^^^^^^^^^^^^^^^^^^^^^^^^^^^^^^^^^^^^^^^^^^^^^^


[INFO] ------------------------------------------------------------------------
[INFO] For more information, run Maven with the -e switch
[INFO] ------------------------------------------------------------------------
[INFO] Total time: 39 seconds
[INFO] Finished at: Mon Jan 03 17:09:45 America/Los_Angeles 2011
[INFO] Final Memory: 37M/160M
[INFO] ------------------------------------------------------------------------
ERROR: Asynchronous execution failure
java.util.concurrent.ExecutionException: java.io.EOFException
	at hudson.remoting.Channel$2.adapt(Channel.java:663)
	at hudson.remoting.Channel$2.adapt(Channel.java:658)
	at hudson.remoting.FutureAdapter.get(FutureAdapter.java:55)
	at hudson.maven.MavenBuilder.call(MavenBuilder.java:176)
	at hudson.maven.MavenModuleSetBuild$Builder.call(MavenModuleSetBuild.java:750)
	at hudson.maven.MavenModuleSetBuild$Builder.call(MavenModuleSetBuild.java:694)
	at hudson.remoting.UserRequest.perform(UserRequest.java:114)
	at hudson.remoting.UserRequest.perform(UserRequest.java:48)
	at hudson.remoting.Request$2.run(Request.java:270)
	at java.util.concurrent.Executors$RunnableAdapter.call(Executors.java:416)
	at java.util.concurrent.FutureTask$Sync.innerRun(FutureTask.java:256)
	at java.util.concurrent.FutureTask.run(FutureTask.java:122)
	at java.util.concurrent.ThreadPoolExecutor$Worker.runTask(ThreadPoolExecutor.java:643)
	at java.util.concurrent.ThreadPoolExecutor$Worker.run(ThreadPoolExecutor.java:668)
	at java.lang.Thread.run(Thread.java:670)
Caused by: java.io.EOFException
	at java.io.DataInputStream.readInt(DataInputStream.java:375)
	at java.io.ObjectInputStream$BlockDataInputStream.readInt(ObjectInputStream.java:2775)
	at java.io.ObjectInputStream.readInt(ObjectInputStream.java:949)
	at hudson.remoting.MultiClassLoaderSerializer$Input.readClassLoader(MultiClassLoaderSerializer.java:88)
	at hudson.remoting.MultiClassLoaderSerializer$Input.resolveProxyClass(MultiClassLoaderSerializer.java:121)
	at java.io.ObjectInputStream.readProxyDesc(ObjectInputStream.java:1530)
	at java.io.ObjectInputStream.readClassDesc(ObjectInputStream.java:1492)
	at java.io.ObjectInputStream.readOrdinaryObject(ObjectInputStream.java:1731)
	at java.io.ObjectInputStream.readObject0(ObjectInputStream.java:1328)
	at java.io.ObjectInputStream.defaultReadFields(ObjectInputStream.java:1946)
	at java.io.ObjectInputStream.readSerialData(ObjectInputStream.java:1870)
	at java.io.ObjectInputStream.readOrdinaryObject(ObjectInputStream.java:1752)
	at java.io.ObjectInputStream.readObject0(ObjectInputStream.java:1328)
	at java.io.ObjectInputStream.readObject(ObjectInputStream.java:350)
	at hudson.remoting.UserRequest.deserialize(UserRequest.java:178)
	at hudson.remoting.UserRequest.perform(UserRequest.java:98)
	at hudson.remoting.UserRequest.perform(UserRequest.java:48)
	at hudson.remoting.Request$2.run(Request.java:270)
	at java.util.concurrent.Executors$RunnableAdapter.call(Executors.java:441)
	at java.util.concurrent.FutureTask$Sync.innerRun(FutureTask.java:303)
	at java.util.concurrent.FutureTask.run(FutureTask.java:138)
	at java.util.concurrent.ThreadPoolExecutor$Worker.runTask(ThreadPoolExecutor.java:886)
	at java.util.concurrent.ThreadPoolExecutor$Worker.run(ThreadPoolExecutor.java:908)
	at java.lang.Thread.run(Thread.java:662)
ERROR: Asynchronous execution failure
java.util.concurrent.ExecutionException: java.io.EOFException
	at hudson.remoting.Channel$2.adapt(Channel.java:663)
	at hudson.remoting.Channel$2.adapt(Channel.java:658)
	at hudson.remoting.FutureAdapter.get(FutureAdapter.java:55)
	at hudson.maven.MavenBuilder.call(MavenBuilder.java:176)
	at hudson.maven.MavenModuleSetBuild$Builder.call(MavenModuleSetBuild.java:750)
	at hudson.maven.MavenModuleSetBuild$Builder.call(MavenModuleSetBuild.java:694)
	at hudson.remoting.UserRequest.perform(UserRequest.java:114)
	at hudson.remoting.UserRequest.perform(UserRequest.java:48)
	at hudson.remoting.Request$2.run(Request.java:270)
	at java.util.concurrent.Executors$RunnableAdapter.call(Executors.java:416)
	at java.util.concurrent.FutureTask$Sync.innerRun(FutureTask.java:256)
	at java.util.concurrent.FutureTask.run(FutureTask.java:122)
	at java.util.concurrent.ThreadPoolExecutor$Worker.runTask(ThreadPoolExecutor.java:643)
	at java.util.concurrent.ThreadPoolExecutor$Worker.run(ThreadPoolExecutor.java:668)
	at java.lang.Thread.run(Thread.java:670)
Caused by: java.io.EOFException
	at java.io.DataInputStream.readInt(DataInputStream.java:375)
	at java.io.ObjectInputStream$BlockDataInputStream.readInt(ObjectInputStream.java:2775)
	at java.io.ObjectInputStream.readInt(ObjectInputStream.java:949)
	at hudson.remoting.MultiClassLoaderSerializer$Input.readClassLoader(MultiClassLoaderSerializer.java:88)
	at hudson.remoting.MultiClassLoaderSerializer$Input.resolveProxyClass(MultiClassLoaderSerializer.java:121)
	at java.io.ObjectInputStream.readProxyDesc(ObjectInputStream.java:1530)
	at java.io.ObjectInputStream.readClassDesc(ObjectInputStream.java:1492)
	at java.io.ObjectInputStream.readOrdinaryObject(ObjectInputStream.java:1731)
	at java.io.ObjectInputStream.readObject0(ObjectInputStream.java:1328)
	at java.io.ObjectInputStream.defaultReadFields(ObjectInputStream.java:1946)
	at java.io.ObjectInputStream.readSerialData(ObjectInputStream.java:1870)
	at java.io.ObjectInputStream.readOrdinaryObject(ObjectInputStream.java:1752)
	at java.io.ObjectInputStream.readObject0(ObjectInputStream.java:1328)
	at java.io.ObjectInputStream.readObject(ObjectInputStream.java:350)
	at hudson.remoting.UserRequest.deserialize(UserRequest.java:178)
	at hudson.remoting.UserRequest.perform(UserRequest.java:98)
	at hudson.remoting.UserRequest.perform(UserRequest.java:48)
	at hudson.remoting.Request$2.run(Request.java:270)
	at java.util.concurrent.Executors$RunnableAdapter.call(Executors.java:441)
	at java.util.concurrent.FutureTask$Sync.innerRun(FutureTask.java:303)
	at java.util.concurrent.FutureTask.run(FutureTask.java:138)
	at java.util.concurrent.ThreadPoolExecutor$Worker.runTask(ThreadPoolExecutor.java:886)
	at java.util.concurrent.ThreadPoolExecutor$Worker.run(ThreadPoolExecutor.java:908)
	at java.lang.Thread.run(Thread.java:662)
ERROR: Asynchronous execution failure
java.util.concurrent.ExecutionException: java.io.EOFException
	at hudson.remoting.Channel$2.adapt(Channel.java:663)
	at hudson.remoting.Channel$2.adapt(Channel.java:658)
	at hudson.remoting.FutureAdapter.get(FutureAdapter.java:55)
	at hudson.maven.MavenBuilder.call(MavenBuilder.java:176)
	at hudson.maven.MavenModuleSetBuild$Builder.call(MavenModuleSetBuild.java:750)
	at hudson.maven.MavenModuleSetBuild$Builder.call(MavenModuleSetBuild.java:694)
	at hudson.remoting.UserRequest.perform(UserRequest.java:114)
	at hudson.remoting.UserRequest.perform(UserRequest.java:48)
	at hudson.remoting.Request$2.run(Request.java:270)
	at java.util.concurrent.Executors$RunnableAdapter.call(Executors.java:416)
	at java.util.concurrent.FutureTask$Sync.innerRun(FutureTask.java:256)
	at java.util.concurrent.FutureTask.run(FutureTask.java:122)
	at java.util.concurrent.ThreadPoolExecutor$Worker.runTask(ThreadPoolExecutor.java:643)
	at java.util.concurrent.ThreadPoolExecutor$Worker.run(ThreadPoolExecutor.java:668)
	at java.lang.Thread.run(Thread.java:670)
Caused by: java.io.EOFException
	at java.io.DataInputStream.readInt(DataInputStream.java:375)
	at java.io.ObjectInputStream$BlockDataInputStream.readInt(ObjectInputStream.java:2775)
	at java.io.ObjectInputStream.readInt(ObjectInputStream.java:949)
	at hudson.remoting.MultiClassLoaderSerializer$Input.readClassLoader(MultiClassLoaderSerializer.java:88)
	at hudson.remoting.MultiClassLoaderSerializer$Input.resolveProxyClass(MultiClassLoaderSerializer.java:121)
	at java.io.ObjectInputStream.readProxyDesc(ObjectInputStream.java:1530)
	at java.io.ObjectInputStream.readClassDesc(ObjectInputStream.java:1492)
	at java.io.ObjectInputStream.readOrdinaryObject(ObjectInputStream.java:1731)
	at java.io.ObjectInputStream.readObject0(ObjectInputStream.java:1328)
	at java.io.ObjectInputStream.defaultReadFields(ObjectInputStream.java:1946)
	at java.io.ObjectInputStream.readSerialData(ObjectInputStream.java:1870)
	at java.io.ObjectInputStream.readOrdinaryObject(ObjectInputStream.java:1752)
	at java.io.ObjectInputStream.readObject0(ObjectInputStream.java:1328)
	at java.io.ObjectInputStream.readObject(ObjectInputStream.java:350)
	at hudson.remoting.UserRequest.deserialize(UserRequest.java:178)
	at hudson.remoting.UserRequest.perform(UserRequest.java:98)
	at hudson.remoting.UserRequest.perform(UserRequest.java:48)
	at hudson.remoting.Request$2.run(Request.java:270)
	at java.util.concurrent.Executors$RunnableAdapter.call(Executors.java:441)
	at java.util.concurrent.FutureTask$Sync.innerRun(FutureTask.java:303)
	at java.util.concurrent.FutureTask.run(FutureTask.java:138)
	at java.util.concurrent.ThreadPoolExecutor$Worker.runTask(ThreadPoolExecutor.java:886)
	at java.util.concurrent.ThreadPoolExecutor$Worker.run(ThreadPoolExecutor.java:908)
	at java.lang.Thread.run(Thread.java:662)
ERROR: Asynchronous execution failure
java.util.concurrent.ExecutionException: java.io.EOFException
	at hudson.remoting.Channel$2.adapt(Channel.java:663)
	at hudson.remoting.Channel$2.adapt(Channel.java:658)
	at hudson.remoting.FutureAdapter.get(FutureAdapter.java:55)
	at hudson.maven.MavenBuilder.call(MavenBuilder.java:176)
	at hudson.maven.MavenModuleSetBuild$Builder.call(MavenModuleSetBuild.java:750)
	at hudson.maven.MavenModuleSetBuild$Builder.call(MavenModuleSetBuild.java:694)
	at hudson.remoting.UserRequest.perform(UserRequest.java:114)
	at hudson.remoting.UserRequest.perform(UserRequest.java:48)
	at hudson.remoting.Request$2.run(Request.java:270)
	at java.util.concurrent.Executors$RunnableAdapter.call(Executors.java:416)
	at java.util.concurrent.FutureTask$Sync.innerRun(FutureTask.java:256)
	at java.util.concurrent.FutureTask.run(FutureTask.java:122)
	at java.util.concurrent.ThreadPoolExecutor$Worker.runTask(ThreadPoolExecutor.java:643)
	at java.util.concurrent.ThreadPoolExecutor$Worker.run(ThreadPoolExecutor.java:668)
	at java.lang.Thread.run(Thread.java:670)
Caused by: java.io.EOFException
	at java.io.DataInputStream.readInt(DataInputStream.java:375)
	at java.io.ObjectInputStream$BlockDataInputStream.readInt(ObjectInputStream.java:2775)
	at java.io.ObjectInputStream.readInt(ObjectInputStream.java:949)
	at hudson.remoting.MultiClassLoaderSerializer$Input.readClassLoader(MultiClassLoaderSerializer.java:88)
	at hudson.remoting.MultiClassLoaderSerializer$Input.resolveProxyClass(MultiClassLoaderSerializer.java:121)
	at java.io.ObjectInputStream.readProxyDesc(ObjectInputStream.java:1530)
	at java.io.ObjectInputStream.readClassDesc(ObjectInputStream.java:1492)
	at java.io.ObjectInputStream.readOrdinaryObject(ObjectInputStream.java:1731)
	at java.io.ObjectInputStream.readObject0(ObjectInputStream.java:1328)
	at java.io.ObjectInputStream.defaultReadFields(ObjectInputStream.java:1946)
	at java.io.ObjectInputStream.readSerialData(ObjectInputStream.java:1870)
	at java.io.ObjectInputStream.readOrdinaryObject(ObjectInputStream.java:1752)
	at java.io.ObjectInputStream.readObject0(ObjectInputStream.java:1328)
	at java.io.ObjectInputStream.readObject(ObjectInputStream.java:350)
	at hudson.remoting.UserRequest.deserialize(UserRequest.java:178)
	at hudson.remoting.UserRequest.perform(UserRequest.java:98)
	at hudson.remoting.UserRequest.perform(UserRequest.java:48)
	at hudson.remoting.Request$2.run(Request.java:270)
	at java.util.concurrent.Executors$RunnableAdapter.call(Executors.java:441)
	at java.util.concurrent.FutureTask$Sync.innerRun(FutureTask.java:303)
	at java.util.concurrent.FutureTask.run(FutureTask.java:138)
	at java.util.concurrent.ThreadPoolExecutor$Worker.runTask(ThreadPoolExecutor.java:886)
	at java.util.concurrent.ThreadPoolExecutor$Worker.run(ThreadPoolExecutor.java:908)
	at java.lang.Thread.run(Thread.java:662)


Mime
View raw message