mina-commits mailing list archives

Site index · List index
Message view « Date » · « Thread »
Top « Date » · « Thread »
From "Continuum@vmbuild.apache.org" <contin...@apache.org>
Subject [continuum] BUILD FAILURE: MINA - Apache Mina SSHD - default maven2 buildDefinition
Date Mon, 22 Dec 2008 11:32:32 GMT
Online report : http://vmbuild.apache.org/continuum/buildResult.action?buildId=132157&projectId=1497

Build statistics:
  State: Failed
  Previous State: Ok
  Started at: Mon 22 Dec 2008 03:20:55 -0800
  Finished at: Mon 22 Dec 2008 03:32:24 -0800
  Total time: 11m 28s
  Build Trigger: Schedule
  Build Number: 1
  Exit code: 1
  Building machine hostname: vmbuild.apache.org
  Operating system : Linux(unknown)
  Java Home version : 
          java version "1.6.0_05"
          Java(TM) SE Runtime Environment (build 1.6.0_05-b13)
          Java HotSpot(TM) Client VM (build 10.0-b19, mixed mode, sharing)
        
  Builder version :
          Maven version: 2.0.9
          Java version: 1.6.0_05
          OS name: "linux" version: "2.6.20-16-server" arch: "i386" Family: "unix"
    
****************************************************************************
SCM Changes:
****************************************************************************
Changed: gnodet @ Mon 22 Dec 2008 02:48:39 -0800
Comment: SSHD-2: Use futures on the client side for asynchronous operations
Files changed:
  /mina/sshd/trunk/src/main/java/org/apache/sshd/ClientChannel.java ( 728642 )
  /mina/sshd/trunk/src/main/java/org/apache/sshd/ClientSession.java ( 728642 )
  /mina/sshd/trunk/src/main/java/org/apache/sshd/SshClient.java ( 728642 )
  /mina/sshd/trunk/src/main/java/org/apache/sshd/SshServer.java ( 728642 )
  /mina/sshd/trunk/src/main/java/org/apache/sshd/client/channel/AbstractClientChannel.java
( 728642 )
  /mina/sshd/trunk/src/main/java/org/apache/sshd/client/channel/ChannelSession.java ( 728642
)
  /mina/sshd/trunk/src/main/java/org/apache/sshd/client/channel/ChannelShell.java ( 728642
)
  /mina/sshd/trunk/src/main/java/org/apache/sshd/client/future ( 728642 )
  /mina/sshd/trunk/src/main/java/org/apache/sshd/client/future/AuthFuture.java ( 728642 )
  /mina/sshd/trunk/src/main/java/org/apache/sshd/client/future/ConnectFuture.java ( 728642
)
  /mina/sshd/trunk/src/main/java/org/apache/sshd/client/future/DefaultAuthFuture.java ( 728642
)
  /mina/sshd/trunk/src/main/java/org/apache/sshd/client/future/DefaultConnectFuture.java (
728642 )
  /mina/sshd/trunk/src/main/java/org/apache/sshd/client/future/DefaultOpenFuture.java ( 728642
)
  /mina/sshd/trunk/src/main/java/org/apache/sshd/client/future/OpenFuture.java ( 728642 )
  /mina/sshd/trunk/src/main/java/org/apache/sshd/client/session/ClientSessionImpl.java ( 728642
)
  /mina/sshd/trunk/src/main/java/org/apache/sshd/common/AbstractSessionIoHandler.java ( 728642
)
  /mina/sshd/trunk/src/main/java/org/apache/sshd/common/Channel.java ( 728642 )
  /mina/sshd/trunk/src/main/java/org/apache/sshd/common/Cipher.java ( 728642 )
  /mina/sshd/trunk/src/main/java/org/apache/sshd/common/RuntimeSshException.java ( 728642
)
  /mina/sshd/trunk/src/main/java/org/apache/sshd/common/Signature.java ( 728642 )
  /mina/sshd/trunk/src/main/java/org/apache/sshd/common/channel/AbstractChannel.java ( 728642
)
  /mina/sshd/trunk/src/main/java/org/apache/sshd/common/future ( 728642 )
  /mina/sshd/trunk/src/main/java/org/apache/sshd/common/future/CloseFuture.java ( 728642 )
  /mina/sshd/trunk/src/main/java/org/apache/sshd/common/future/DefaultCloseFuture.java ( 728642
)
  /mina/sshd/trunk/src/main/java/org/apache/sshd/common/future/DefaultSshFuture.java ( 728642
)
  /mina/sshd/trunk/src/main/java/org/apache/sshd/common/future/SshFuture.java ( 728642 )
  /mina/sshd/trunk/src/main/java/org/apache/sshd/common/future/SshFutureListener.java ( 728642
)
  /mina/sshd/trunk/src/main/java/org/apache/sshd/common/session/AbstractSession.java ( 728642
)
  /mina/sshd/trunk/src/main/java/org/apache/sshd/server/channel/ChannelSession.java ( 728642
)
  /mina/sshd/trunk/src/main/java/org/apache/sshd/server/session/ServerSession.java ( 728642
)
  /mina/sshd/trunk/src/test/java/org/apache/sshd/CipherTest.java ( 728642 )
  /mina/sshd/trunk/src/test/java/org/apache/sshd/ClientTest.java ( 728642 )
  /mina/sshd/trunk/src/test/java/org/apache/sshd/ServerTest.java ( 728642 )
  /mina/sshd/trunk/src/test/resources/log4j.properties ( 728642 )

Changed: gnodet @ Mon 22 Dec 2008 03:10:47 -0800
Comment: SSHD-3: Provide access to the session and the authentication bits from commands
Files changed:
  /mina/sshd/trunk/src/main/java/org/apache/sshd/server/CommandFactory.java ( 728645 )
  /mina/sshd/trunk/src/main/java/org/apache/sshd/server/channel/ChannelSession.java ( 728645
)

****************************************************************************
Dependencies Changes:
****************************************************************************
No dependencies changed


****************************************************************************
Build Definition:
****************************************************************************
POM filename: pom.xml
Goals: clean install   
Arguments: --batch-mode --non-recursive
Build Fresh: false
Always Build: false
Default Build Definition: true
Schedule: DEFAULT_SCHEDULE
Description: default maven2 buildDefinition

****************************************************************************
Test Summary:
****************************************************************************
Tests: 26
Failures: 1
Total time: 657.495

****************************************************************************
Test Failures:
****************************************************************************

ServerTest
    testAuthenticationTimeout :
  java.lang.AssertionError
  java.lang.AssertionError: 
	at org.junit.Assert.fail(Assert.java:74)
	at org.junit.Assert.assertTrue(Assert.java:37)
	at org.junit.Assert.assertTrue(Assert.java:46)
	at org.apache.sshd.ServerTest.testAuthenticationTimeout(ServerTest.java:94)
	at sun.reflect.NativeMethodAccessorImpl.invoke0(Native Method)
	at sun.reflect.NativeMethodAccessorImpl.invoke(NativeMethodAccessorImpl.java:39)
	at sun.reflect.DelegatingMethodAccessorImpl.invoke(DelegatingMethodAccessorImpl.java:25)
	at java.lang.reflect.Method.invoke(Method.java:597)
	at org.junit.internal.runners.TestMethod.invoke(TestMethod.java:59)
	at org.junit.internal.runners.MethodRoadie.runTestMethod(MethodRoadie.java:98)
	at org.junit.internal.runners.MethodRoadie$2.run(MethodRoadie.java:79)
	at org.junit.internal.runners.MethodRoadie.runBeforesThenTestThenAfters(MethodRoadie.java:87)
	at org.junit.internal.runners.MethodRoadie.runTest(MethodRoadie.java:77)
	at org.junit.internal.runners.MethodRoadie.run(MethodRoadie.java:42)
	at org.junit.internal.runners.JUnit4ClassRunner.invokeTestMethod(JUnit4ClassRunner.java:88)
	at org.junit.internal.runners.JUnit4ClassRunner.runMethods(JUnit4ClassRunner.java:51)
	at org.junit.internal.runners.JUnit4ClassRunner$1.run(JUnit4ClassRunner.java:44)
	at org.junit.internal.runners.ClassRoadie.runUnprotected(ClassRoadie.java:27)
	at org.junit.internal.runners.ClassRoadie.runProtected(ClassRoadie.java:37)
	at org.junit.internal.runners.JUnit4ClassRunner.run(JUnit4ClassRunner.java:42)
	at org.apache.maven.surefire.junit4.JUnit4TestSet.execute(JUnit4TestSet.java:62)
	at org.apache.maven.surefire.suite.AbstractDirectoryTestSuite.executeTestSet(AbstractDirectoryTestSuite.java:140)
	at org.apache.maven.surefire.suite.AbstractDirectoryTestSuite.execute(AbstractDirectoryTestSuite.java:127)
	at org.apache.maven.surefire.Surefire.run(Surefire.java:177)
	at sun.reflect.NativeMethodAccessorImpl.invoke0(Native Method)
	at sun.reflect.NativeMethodAccessorImpl.invoke(NativeMethodAccessorImpl.java:39)
	at sun.reflect.DelegatingMethodAccessorImpl.invoke(DelegatingMethodAccessorImpl.java:25)
	at java.lang.reflect.Method.invoke(Method.java:597)
	at org.apache.maven.surefire.booter.SurefireBooter.runSuitesInProcess(SurefireBooter.java:338)
	at org.apache.maven.surefire.booter.SurefireBooter.main(SurefireBooter.java:997)


  



Mime
View raw message