metamodel-dev mailing list archives

Site index · List index
Message view « Date » · « Thread »
Top « Date » · « Thread »
From Kasper Sørensen (JIRA) <j...@apache.org>
Subject [jira] [Commented] (METAMODEL-171) CassandraUnit tests failing during release
Date Tue, 18 Aug 2015 20:08:45 GMT

    [ https://issues.apache.org/jira/browse/METAMODEL-171?page=com.atlassian.jira.plugin.system.issuetabpanels:comment-tabpanel&focusedCommentId=14701906#comment-14701906
] 

Kasper Sørensen commented on METAMODEL-171:
-------------------------------------------

Interesting observation: This now also just failed in a normal build on my machine ... I'll
try and see if I can figure out what it is then, because I guess it should be more reproducable
then.

> CassandraUnit tests failing during release
> ------------------------------------------
>
>                 Key: METAMODEL-171
>                 URL: https://issues.apache.org/jira/browse/METAMODEL-171
>             Project: Apache MetaModel
>          Issue Type: Bug
>            Reporter: Kasper Sørensen
>
> I don't know why this is happening, but when I try to run the mvn release plugin to post
a release candidate, I get unittest errors in the cassandra module. I don't get these errors
during a normal build!
> {code}
> [INFO] Tests run: 9, Failures: 0, Errors: 2, Skipped: 0, Time elapsed: 20.64 sec <<<
FAILURE! - in org.apache.metamodel.cassandra.CassandraD
> ataContextTest
> [INFO] testCounterDataType(org.apache.metamodel.cassandra.CassandraDataContextTest) 
Time elapsed: 2.309 sec  <<< ERROR!
> [INFO] com.datastax.driver.core.exceptions.NoHostAvailableException: All host(s) tried
for query failed (no host was tried)
> [INFO]  at com.datastax.driver.core.RequestHandler.sendRequest(RequestHandler.java:105)
> [INFO]  at com.datastax.driver.core.SessionManager.execute(SessionManager.java:446)
> [INFO]  at com.datastax.driver.core.SessionManager.executeQuery(SessionManager.java:482)
> [INFO]  at com.datastax.driver.core.SessionManager.executeAsync(SessionManager.java:88)
> [INFO]  at com.datastax.driver.core.AbstractSession.execute(AbstractSession.java:52)
> [INFO]  at com.datastax.driver.core.AbstractSession.execute(AbstractSession.java:36)
> [INFO]  at org.apache.metamodel.cassandra.CassandraDataContextTest.populateCassandraTableWithSomeData(CassandraDataContextTest.java:210)
> [INFO]  at org.apache.metamodel.cassandra.CassandraDataContextTest.setUp(CassandraDataContextTest.java:61)
> [INFO]
> [INFO] testWhereColumnInValues(org.apache.metamodel.cassandra.CassandraDataContextTest)
 Time elapsed: 1.03 sec  <<< ERROR!
> [INFO] com.datastax.driver.core.exceptions.NoHostAvailableException: All host(s) tried
for query failed (tried: /127.0.0.1:9142 (com.datasta
> x.driver.core.TransportException: [/127.0.0.1:9142] Cannot connect))
> [INFO]  at com.datastax.driver.core.ControlConnection.reconnectInternal(ControlConnection.java:199)
> [INFO]  at com.datastax.driver.core.ControlConnection.connect(ControlConnection.java:80)
> [INFO]  at com.datastax.driver.core.Cluster$Manager.init(Cluster.java:1154)
> [INFO]  at com.datastax.driver.core.Cluster.init(Cluster.java:154)
> [INFO]  at com.datastax.driver.core.Cluster.connect(Cluster.java:230)
> [INFO]  at org.apache.metamodel.cassandra.CassandraDataContextTest.setUp(CassandraDataContextTest.java:59)
> [INFO]
> [INFO]
> [INFO] Results :
> [INFO]
> [INFO] Tests in error:
> [INFO]   CassandraDataContextTest.setUp:61->populateCassandraTableWithSomeData:210
╗ NoHostAvailable
> [INFO]   CassandraDataContextTest.setUp:59 ╗ NoHostAvailable All host(s) tried for
quer...
> {code}
> Anybody has a clue



--
This message was sent by Atlassian JIRA
(v6.3.4#6332)

Mime
View raw message