mesos-user mailing list archives

Site index · List index
Message view « Date » · « Thread »
Top « Date » · « Thread »
From Alexander Gallego <agall...@concord.io>
Subject Re: ERROR while installing mesos
Date Thu, 29 Oct 2015 15:17:54 GMT
Did you add any ./configure flags?

On Thu, Oct 29, 2015 at 3:04 AM, Sharma, Showvik <showvik.sharma@citi.com>
wrote:

> Hi,
>
>
>
> While installing mesos, first I configured mesos-0.25.0. Everything was
> perfectly fine.
>
> But  while doing make I am getting below error.
>
>
>
>
>
> /bin/sh ../libtool  --tag=3DCXX   --mode=3Dlink g++ -pthread -g1 -O0
> -Wno-unused-local-typedefs -std=3Dc++11 -Wl,--as-needed  -o mesos-local
> local/mesos_local-main.o libmesos.la     -lsasl2 -lsvn_delta-1
> -lsvn_subr-1 -lapr-1 -lcurl -lz  -lrt
>
> libtool: link: g++ -pthread -g1 -O0 -Wno-unused-local-typedefs
> -std=3Dc++11=  -Wl,--as-needed -o .libs/mesos-local
> local/mesos_local-main.o  ./.libs/lib= mesos.so -lsasl2
> /usr/lib64/libsvn_delta-1.so /usr/lib64/libsvn_subr-1.so /=
> usr/lib64/libaprutil-1.so -lcrypt -lexpat -ldb-5.3 /usr/lib64/libapr-1.so
> -= lpthread -ldl -lcurl -lz -lrt -pthread -Wl,-rpath -Wl,/usr/local/lib
> -Wl,-r= path -Wl,/usr/lib64
>
> ./.libs/libmesos.so: undefined reference to `svn_txdelta2'
>
> collect2: error: ld returned 1 exit status
>
> make[2]: *** [mesos-local] Error 1
>
> make[2]: Leaving directory `/home/mesos-0.25.0/build/src'
>
> make[1]: *** [all] Error 2
>
> make[1]: Leaving directory `/home/mesos-0.25.0/build/src'
>
> make: *** [all-recursive] Error 1
>
>
>
> Can you please tell me what to do so that I can resolve this issue.
>
>
>
>
>
> Thanks
>
> Showvik
>
>
>



--

Mime
View raw message