mesos-reviews mailing list archives

Site index · List index
Message view « Date » · « Thread »
Top « Date » · « Thread »
From Mesos Reviewbot Windows <revi...@mesos.apache.org>
Subject Re: Review Request 66493: Made FreeBSD default to non-GNU ld.
Date Sat, 07 Apr 2018 15:54:19 GMT

-----------------------------------------------------------
This is an automatically generated e-mail. To reply, visit:
https://reviews.apache.org/r/66493/#review200704
-----------------------------------------------------------



FAIL: Some of the unit tests failed. Please check the relevant logs.

Reviews applied: `['66493']`

Failed command: `Start-MesosCITesting`

All the build artifacts available at: http://dcos-win.westus.cloudapp.azure.com/mesos-build/review/66493

Relevant logs:

- [mesos-tests-stdout.log](http://dcos-win.westus.cloudapp.azure.com/mesos-build/review/66493/logs/mesos-tests-stdout.log):

```
[       OK ] Endpoint/SlaveEndpointTest.NoAuthorizer/2 (123 ms)
[----------] 9 tests from Endpoint/SlaveEndpointTest (1084 ms total)

[----------] 2 tests from ContainerizerType/DefaultContainerDNSFlagTest
[ RUN      ] ContainerizerType/DefaultContainerDNSFlagTest.ValidateFlag/0
[       OK ] ContainerizerType/DefaultContainerDNSFlagTest.ValidateFlag/0 (45 ms)
[ RUN      ] ContainerizerType/DefaultContainerDNSFlagTest.ValidateFlag/1
[       OK ] ContainerizerType/DefaultContainerDNSFlagTest.ValidateFlag/1 (40 ms)
[----------] 2 tests from ContainerizerType/DefaultContainerDNSFlagTest (86 ms total)

[----------] 1 test from IsolationFlag/CpuIsolatorTest
[ RUN      ] IsolationFlag/CpuIsolatorTest.ROOT_UserCpuUsage/0
[       OK ] IsolationFlag/CpuIsolatorTest.ROOT_UserCpuUsage/0 (781 ms)
[----------] 1 test from IsolationFlag/CpuIsolatorTest (812 ms total)

[----------] 1 test from IsolationFlag/MemoryIsolatorTest
[ RUN      ] IsolationFlag/MemoryIsolatorTest.ROOT_MemUsage/0
[       OK ] IsolationFlag/MemoryIsolatorTest.ROOT_MemUsage/0 (820 ms)
[----------] 1 test from IsolationFlag/MemoryIsolatorTest (850 ms total)

[----------] Global test environment tear-down
[==========] 954 tests from 94 test cases ran. (471114 ms total)
[  PASSED  ] 953 tests.
[  FAILED  ] 1 test, listed below:
[  FAILED  ] CommandExecutorCheckTest.CommandCheckTimeout

 1 FAILED TEST
  YOU HAVE 214 DISABLED TESTS

```

- [mesos-tests-stderr.log](http://dcos-win.westus.cloudapp.azure.com/mesos-build/review/66493/logs/mesos-tests-stderr.log):

```
I0407 15:54:06.660614  6244 slave.cpp:3973] Shutting down framework 9a9994b3-1787-4ad6-8233-b01006c6d4cc-0000
I0407 15:54:06.660614 11604 master.cpp:10452] Updating the state of task 11cd7869-bc96-4572-9fd5-50a79f56ea4f
of framework 9a9994b3-1787-4ad6-8233-b01006c6d4cc-0000 (latest state: TASK_KILLED, status
update state: TASK_KILLED)
I0407 15:54:06.660614  6244 slave.cpp:6670] Shutting down executor '11cd7869-bc96-4572-9fd5-50a79f56ea4f'
of framework 9a9994b3-1787-4ad6-8233-b01006c6d4cc-0000I0407 15:54:06.476617 10892 exec.cpp:162]
Version: 1.6.0
I0407 15:54:06.505643 19036 exec.cpp:236] Executor registered on agent 9a9994b3-1787-4ad6-8233-b01006c6d4cc-S0
I0407 15:54:06.509647 17620 executor.cpp:177] Received SUBSCRIBED event
I0407 15:54:06.515609 17620 executor.cpp:181] Subscribed executor on winbldsrv-01.zq4gs31qjdiunm1ryi1452nvnh.dx.internal.cloudapp.net
I0407 15:54:06.515609 17620 executor.cpp:177] Received LAUNCH event
I0407 15:54:06.520608 17620 executor.cpp:649] Starting task 11cd7869-bc96-4572-9fd5-50a79f56ea4f
I0407 15:54:06.605608 17620 executor.cpp:484] Running 'D:\DCOS\mesos\src\mesos-containerizer.exe
launch <POSSIBLY-SENSITIVE-DATA>'
I0407 15:54:06.633612 17620 executor.cpp:662] Forked command at 19160
I0407 15:54:06.662616  6500 exec.cpp:445] Executor asked to shutdown
I0407 15:54:06.663614 18180 executor.cpp:177] Received SHUTDOWN event
I0407 15:54:06.663614 18180 executor.cpp:759] Shutting down
I0407 15:54:06.663614 18180 executor.cpp:869] Sending SIGTERM to process tree at pid  at executor(1)@10.3.1.8:51782
I0407 15:54:06.662616  6244 slave.cpp:923] Agent terminating
W0407 15:54:06.662616  6244 slave.cpp:3969] Ignoring shutdown framework 9a9994b3-1787-4ad6-8233-b01006c6d4cc-0000
because it is terminating
I0407 15:54:06.663614 11604 master.cpp:10551] Removing task 11cd7869-bc96-4572-9fd5-50a79f56ea4f
with resources cpus(allocated: *):4; mem(allocated: *):2048; disk(allocated: *):1024; ports(allocated:
*):[31000-32000] of framework 9a9994b3-1787-4ad6-8233-b01006c6d4cc-0000 on agent 9a9994b3-1787-4ad6-8233-b01006c6d4cc-S0
at slave(423)@10.3.1.8:51761 (winbldsrv-01.zq4gs31qjdiunm1ryi1452nvnh.dx.internal.cloudapp.net)
I0407 15:54:06.665613 12344 containerizer.cpp:2338] Destroying container eecdbd30-1cf4-4c9b-8485-0e1260cf5ada
in RUNNING state
I0407 15:54:06.666613 12344 containerizer.cpp:2952] Transitioning the state of container eecdbd30-1cf4-4c9b-8485-0e1260cf5ada
from RUNNING to DESTROYING
I0407 15:54:06.666613 11604 master.cpp:1295] Agent 9a9994b3-1787-4ad6-8233-b01006c6d4cc-S0
at slave(423)@10.3.1.8:51761 (winbldsrv-01.zq4gs31qjdiunm1ryi1452nvnh.dx.internal.cloudapp.net)
disconnected
I0407 15:54:06.666613 17440 hierarchical.cpp:344] Removed framework 9a9994b3-1787-4ad6-8233-b01006c6d4cc-0000
I0407 15:54:06.667620 11604 master.cpp:3286] Disconnecting agent 9a9994b3-1787-4ad6-8233-b01006c6d4cc-S0
at slave(423)@10.3.1.8:51761 (winbldsrv-01.zq4gs31qjdiunm1ryi1452nvnh.dx.internal.cloudapp.net)
I0407 15:54:06.667620 12344 launcher.cpp:156] Asked to destroy container eecdbd30-1cf4-4c9b-8485-0e1260cf5ada
I0407 15:54:06.667620 11604 master.cpp:3305] Deactivating agent 9a9994b3-1787-4ad6-8233-b01006c6d4cc-S0
at slave(423)@10.3.1.8:51761 (winbldsrv-01.zq4gs31qjdiunm1ryi1452nvnh.dx.internal.cloudapp.net)
I0407 15:54:06.667620 17040 hierarchical.cpp:766] Agent 9a9994b3-1787-4ad6-8233-b01006c6d4cc-S0
deactivated
I0407 15:54:06.698618  6244 containerizer.cpp:2791] Container eecdbd30-1cf4-4c9b-8485-0e1260cf5ada
has exited
I0407 15:54:06.730644 17500 master.cpp:1137] Master terminating
I0407 15:54:06.733618 17616 hierarchical.cpp:609] Removed agent 9a9994b3-1787-4ad6-8233-b01006c6d4cc-S0
I0407 15:54:07.163676  5012 process.cpp:929] Stopped the socket accept loop
```

- Mesos Reviewbot Windows


On April 7, 2018, 2:54 p.m., David Forsythe wrote:
> 
> -----------------------------------------------------------
> This is an automatically generated e-mail. To reply, visit:
> https://reviews.apache.org/r/66493/
> -----------------------------------------------------------
> 
> (Updated April 7, 2018, 2:54 p.m.)
> 
> 
> Review request for mesos, Andrew Schwartzmeyer and Benjamin Bannier.
> 
> 
> Bugs: MESOS-8761
>     https://issues.apache.org/jira/browse/MESOS-8761
> 
> 
> Repository: mesos
> 
> 
> Description
> -------
> 
> Made FreeBSD default to non-GNU ld.
> 
> 
> Diffs
> -----
> 
>   cmake/CompilationConfigure.cmake 3cb072ddcd286c0e40d44eaeba210ddf1796975c 
> 
> 
> Diff: https://reviews.apache.org/r/66493/diff/1/
> 
> 
> Testing
> -------
> 
> make on FreeBSD, with both lld and gold.
> 
> 
> Thanks,
> 
> David Forsythe
> 
>


Mime
  • Unnamed multipart/alternative (inline, None, 0 bytes)
View raw message