mesos-reviews mailing list archives

Site index · List index
Message view « Date » · « Thread »
Top « Date » · « Thread »
From Mesos Reviewbot Windows <revi...@mesos.apache.org>
Subject Re: Review Request 66445: Windows: Cleaned up included CRT headers.
Date Sat, 07 Apr 2018 00:14:26 GMT

-----------------------------------------------------------
This is an automatically generated e-mail. To reply, visit:
https://reviews.apache.org/r/66445/#review200688
-----------------------------------------------------------



FAIL: Some of the unit tests failed. Please check the relevant logs.

Reviews applied: `['66423', '66424', '66425', '66426', '66427', '66428', '66455', '66429',
'66430', '66431', '66432', '66434', '66435', '66436', '66437', '66433', '66438', '66439',
'66440', '66442', '66443', '66444', '66445']`

Failed command: `Start-MesosCITesting`

All the build artifacts available at: http://dcos-win.westus.cloudapp.azure.com/mesos-build/review/66445

Relevant logs:

- [mesos-tests-stdout.log](http://dcos-win.westus.cloudapp.azure.com/mesos-build/review/66445/logs/mesos-tests-stdout.log):

```
[       OK ] Endpoint/SlaveEndpointTest.NoAuthorizer/2 (125 ms)
[----------] 9 tests from Endpoint/SlaveEndpointTest (1107 ms total)

[----------] 2 tests from ContainerizerType/DefaultContainerDNSFlagTest
[ RUN      ] ContainerizerType/DefaultContainerDNSFlagTest.ValidateFlag/0
[       OK ] ContainerizerType/DefaultContainerDNSFlagTest.ValidateFlag/0 (35 ms)
[ RUN      ] ContainerizerType/DefaultContainerDNSFlagTest.ValidateFlag/1
[       OK ] ContainerizerType/DefaultContainerDNSFlagTest.ValidateFlag/1 (38 ms)
[----------] 2 tests from ContainerizerType/DefaultContainerDNSFlagTest (76 ms total)

[----------] 1 test from IsolationFlag/CpuIsolatorTest
[ RUN      ] IsolationFlag/CpuIsolatorTest.ROOT_UserCpuUsage/0
[       OK ] IsolationFlag/CpuIsolatorTest.ROOT_UserCpuUsage/0 (775 ms)
[----------] 1 test from IsolationFlag/CpuIsolatorTest (801 ms total)

[----------] 1 test from IsolationFlag/MemoryIsolatorTest
[ RUN      ] IsolationFlag/MemoryIsolatorTest.ROOT_MemUsage/0
[       OK ] IsolationFlag/MemoryIsolatorTest.ROOT_MemUsage/0 (842 ms)
[----------] 1 test from IsolationFlag/MemoryIsolatorTest (867 ms total)

[----------] Global test environment tear-down
[==========] 954 tests from 94 test cases ran. (467793 ms total)
[  PASSED  ] 953 tests.
[  FAILED  ] 1 test, listed below:
[  FAILED  ] CommandExecutorCheckTest.CommandCheckTimeout

 1 FAILED TEST
  YOU HAVE 214 DISABLED TESTS

```

- [mesos-tests-stderr.log](http://dcos-win.westus.cloudapp.azure.com/mesos-build/review/66445/logs/mesos-tests-stderr.log):

```
I0407 00:14:09.339630 15772 master.cpp:10452] Updating the state of task 581ca225-d5be-4a9d-bd24-16c0730a05b7
of framework 5f5619de-7136-40e9-a80d-ac18a89509a6-0000 (latest state: TASK_KILLED, status
update state: TASK_KILLED)
I0407 00:14:09.339630 14372 slave.cpp:3973] Shutting down framework 5f5619de-7136-40e9-a80d-ac18a89509a6-0000
I0407 00:14:09.339630 14372 slave.cpp:6670] Shutting down executor '581ca225-d5be-4a9d-bd24-16c0730a05b7'
of framework 5f5619de-7136-40e9-a80d-ac18a89509a6-0000 at executor(1)@10.3.1.8:65408
I0407 00:14:09.340621 14372 slave.cpp:923] Agent terminating
W0407 00:14:09.340621 14372 slavI0407 00:14:09.146625 16972 exec.cpp:162] Version: 1.6.0
I0407 00:14:09.175635  4452 exec.cpp:236] Executor registered on agent 5f5619de-7136-40e9-a80d-ac18a89509a6-S0
I0407 00:14:09.180619 17520 executor.cpp:177] Received SUBSCRIBED event
I0407 00:14:09.185617 17520 executor.cpp:181] Subscribed executor on winbldsrv-01.zq4gs31qjdiunm1ryi1452nvnh.dx.internal.cloudapp.net
I0407 00:14:09.185617 17520 executor.cpp:177] Received LAUNCH event
I0407 00:14:09.190620 17520 executor.cpp:649] Starting task 581ca225-d5be-4a9d-bd24-16c0730a05b7
I0407 00:14:09.279657 17520 executor.cpp:484] Running 'D:\DCOS\mesos\src\mesos-containerizer.exe
launch <POSSIBLY-SENSITIVE-DATA>'
I0407 00:14:09.309659 17520 executor.cpp:662] Forked command at 19044
I0407 00:14:09.341650 11320 exec.cpp:445] Executor asked to shutdown
I0407 00:14:09.341650 15288 executor.cpp:177] Received SHUTDOWN event
I0407 00:14:09.341650 15288 executor.cpp:759] Shutting down
I0407 00:14:09.341650 15288 executor.cpp:869] Sending SIGTERM to process tree at pid e.cpp:3969]
Ignoring shutdown framework 5f5619de-7136-40e9-a80d-ac18a89509a6-0000 because it is terminating
I0407 00:14:09.342628 15772 master.cpp:10551] Removing task 581ca225-d5be-4a9d-bd24-16c0730a05b7
with resources cpus(allocated: *):4; mem(allocated: *):2048; disk(allocated: *):1024; ports(allocated:
*):[31000-32000] of framework 5f5619de-7136-40e9-a80d-ac18a89509a6-0000 on agent 5f5619de-7136-40e9-a80d-ac18a89509a6-S0
at slave(423)@10.3.1.8:65387 (winbldsrv-01.zq4gs31qjdiunm1ryi1452nvnh.dx.internal.cloudapp.net)
I0407 00:14:09.344620 15216 containerizer.cpp:2338] Destroying container 1f11ebaf-3035-46f8-ac1f-eaf3dc6d0059
in RUNNING state
I0407 00:14:09.344620 15216 containerizer.cpp:2952] Transitioning the state of container 1f11ebaf-3035-46f8-ac1f-eaf3dc6d0059
from RUNNING to DESTROYING
I0407 00:14:09.345892 15772 master.cpp:1295] Agent 5f5619de-7136-40e9-a80d-ac18a89509a6-S0
at slave(423)@10.3.1.8:65387 (winbldsrv-01.zq4gs31qjdiunm1ryi1452nvnh.dx.internal.cloudapp.net)
disconnected
I0407 00:14:09.345892 15772 master.cpp:3286] Disconnecting agent 5f5619de-7136-40e9-a80d-ac18a89509a6-S0
at slave(423)@10.3.1.8:65387 (winbldsrv-01.zq4gs31qjdiunm1ryi1452nvnh.dx.internal.cloudapp.net)
I0407 00:14:09.345892 13776 hierarchical.cpp:344] Removed framework 5f5619de-7136-40e9-a80d-ac18a89509a6-0000
I0407 00:14:09.345892 15216 launcher.cpp:156] Asked to destroy container 1f11ebaf-3035-46f8-ac1f-eaf3dc6d0059
I0407 00:14:09.346639 15772 master.cpp:3305] Deactivating agent 5f5619de-7136-40e9-a80d-ac18a89509a6-S0
at slave(423)@10.3.1.8:65387 (winbldsrv-01.zq4gs31qjdiunm1ryi1452nvnh.dx.internal.cloudapp.net)
I0407 00:14:09.346639 14372 hierarchical.cpp:766] Agent 5f5619de-7136-40e9-a80d-ac18a89509a6-S0
deactivated
I0407 00:14:09.440850  2980 containerizer.cpp:2791] Container 1f11ebaf-3035-46f8-ac1f-eaf3dc6d0059
has exited
I0407 00:14:09.472859 18740 master.cpp:1137] Master terminating
I0407 00:14:09.475013 15216 hierarchical.cpp:609] Removed agent 5f5619de-7136-40e9-a80d-ac18a89509a6-S0
I0407 00:14:09.917861 17076 process.cpp:929] Stopped the socket accept loop
```

- Mesos Reviewbot Windows


On April 6, 2018, 11:18 p.m., Andrew Schwartzmeyer wrote:
> 
> -----------------------------------------------------------
> This is an automatically generated e-mail. To reply, visit:
> https://reviews.apache.org/r/66445/
> -----------------------------------------------------------
> 
> (Updated April 6, 2018, 11:18 p.m.)
> 
> 
> Review request for mesos, Akash Gupta, Eric Mumau, John Kordich, Joseph Wu, and Michael
Park.
> 
> 
> Bugs: MESOS-8759
>     https://issues.apache.org/jira/browse/MESOS-8759
> 
> 
> Repository: mesos
> 
> 
> Description
> -------
> 
> The set `errno` value in `os::kill()` is never checked (especially on
> Windows), so `_set_errno()` and thus `errno.h` were removed.
> 
> The `fcntl.h` is used only to provide `O_CREAT` etc., and so belonged
> in `open.hpp`, not `windows.hpp`.
> 
> The remaining headers, `direct.h`, `io.h`, `process.h`, and `stdlib.h`
> were no longer used or needed as the respective CRT APIs were
> replaced.
> 
> 
> Diffs
> -----
> 
>   3rdparty/stout/include/stout/os/windows/kill.hpp 9cec1117fac3cf6bd624fc7db524ef1ad10cd55d

>   3rdparty/stout/include/stout/os/windows/mkdtemp.hpp 9181429383a991fe2b87701d2bfd0e858ac2537b

>   3rdparty/stout/include/stout/os/windows/open.hpp PRE-CREATION 
>   3rdparty/stout/include/stout/os/windows/rmdir.hpp a2926dab2c8e219cf5938c4df27f83488198dd6b

>   3rdparty/stout/include/stout/os/windows/sendfile.hpp fff5872db6b3f69464e41e6d108a107e4eeabd12

>   3rdparty/stout/include/stout/windows.hpp 1bfcdf4a5c097cc6d2293396ce39c8ad2c9ec993 
>   3rdparty/stout/include/stout/windows/dynamiclibrary.hpp 5b3cbf4f36ea9ac0411df52b4cfea8ef75fecbb5

>   3rdparty/stout/include/stout/windows/os.hpp 900baf9be4e3089cb43e444b14b155a80bcd1591

> 
> 
> Diff: https://reviews.apache.org/r/66445/diff/2/
> 
> 
> Testing
> -------
> 
> 
> Thanks,
> 
> Andrew Schwartzmeyer
> 
>


Mime
  • Unnamed multipart/alternative (inline, None, 0 bytes)
View raw message