mesos-reviews mailing list archives

Site index · List index
Message view « Date » · « Thread »
Top « Date » · « Thread »
From Mesos Reviewbot Windows <revi...@mesos.apache.org>
Subject Re: Review Request 66476: Tightened resource provider manager registrar tests.
Date Thu, 05 Apr 2018 15:24:09 GMT

-----------------------------------------------------------
This is an automatically generated e-mail. To reply, visit:
https://reviews.apache.org/r/66476/#review200553
-----------------------------------------------------------



FAIL: Some of the unit tests failed. Please check the relevant logs.

Reviews applied: `['66476']`

Failed command: `Start-MesosCITesting`

All the build artifacts available at: http://dcos-win.westus.cloudapp.azure.com/mesos-build/review/66476

Relevant logs:

- [mesos-tests-stdout.log](http://dcos-win.westus.cloudapp.azure.com/mesos-build/review/66476/logs/mesos-tests-stdout.log):

```
[       OK ] Endpoint/SlaveEndpointTest.NoAuthorizer/2 (113 ms)
[----------] 9 tests from Endpoint/SlaveEndpointTest (1078 ms total)

[----------] 2 tests from ContainerizerType/DefaultContainerDNSFlagTest
[ RUN      ] ContainerizerType/DefaultContainerDNSFlagTest.ValidateFlag/0
[       OK ] ContainerizerType/DefaultContainerDNSFlagTest.ValidateFlag/0 (35 ms)
[ RUN      ] ContainerizerType/DefaultContainerDNSFlagTest.ValidateFlag/1
[       OK ] ContainerizerType/DefaultContainerDNSFlagTest.ValidateFlag/1 (38 ms)
[----------] 2 tests from ContainerizerType/DefaultContainerDNSFlagTest (77 ms total)

[----------] 1 test from IsolationFlag/CpuIsolatorTest
[ RUN      ] IsolationFlag/CpuIsolatorTest.ROOT_UserCpuUsage/0
[       OK ] IsolationFlag/CpuIsolatorTest.ROOT_UserCpuUsage/0 (817 ms)
[----------] 1 test from IsolationFlag/CpuIsolatorTest (845 ms total)

[----------] 1 test from IsolationFlag/MemoryIsolatorTest
[ RUN      ] IsolationFlag/MemoryIsolatorTest.ROOT_MemUsage/0
[       OK ] IsolationFlag/MemoryIsolatorTest.ROOT_MemUsage/0 (817 ms)
[----------] 1 test from IsolationFlag/MemoryIsolatorTest (844 ms total)

[----------] Global test environment tear-down
[==========] 949 tests from 94 test cases ran. (450888 ms total)
[  PASSED  ] 948 tests.
[  FAILED  ] 1 test, listed below:
[  FAILED  ] CommandExecutorCheckTest.CommandCheckTimeout

 1 FAILED TEST
  YOU HAVE 214 DISABLED TESTS

```

- [mesos-tests-stderr.log](http://dcos-win.westus.cloudapp.azure.com/mesos-build/review/66476/logs/mesos-tests-stderr.log):

```
I0405 15:23:55.351030 16460 slave.cpp:3877] Shutting down framework f1432ba7-03c7-4I0405 15:23:55.172027
12168 exec.cpp:162] Version: 1.6.0
I0405 15:23:55.198027 16364 exec.cpp:236] Executor registered on agent f1432ba7-03c7-4d28-82b1-7934de858cda-S0
I0405 15:23:55.202061 11060 executor.cpp:176] Received SUBSCRIBED event
I0405 15:23:55.207022 11060 executor.cpp:180] Subscribed executor on winbldsrv-01.zq4gs31qjdiunm1ryi1452nvnh.dx.internal.cloudapp.net
I0405 15:23:55.208024 11060 executor.cpp:176] Received LAUNCH event
I0405 15:23:55.214015 11060 executor.cpp:648] Starting task 13a1cb3a-1f23-4cbb-bc03-8e3cc8c5f5ed
I0405 15:23:55.296026 11060 executor.cpp:483] Running 'D:\DCOS\mesos\src\mesos-containerizer.exe
launch <POSSIBLY-SENSITIVE-DATA>'
I0405 15:23:55.324012 11060 executor.cpp:661] Forked command at 12860
I0405 15:23:55.353013  2016 exec.cpp:445] Executor asked to shutdown
I0405 15:23:55.354010  7588 executor.cpp:176] Received SHUTDOWN event
I0405 15:23:55.354010  7588 executor.cpp:758] Shutting down
I0405 15:23:55.354010  7588 executor.cpp:868] Sending SIGTERM to process tree at pid d28-82b1-7934de858cda-0000
I0405 15:23:55.351030 15828 master.cpp:10449] Updating the state of task 13a1cb3a-1f23-4cbb-bc03-8e3cc8c5f5ed
of framework f1432ba7-03c7-4d28-82b1-7934de858cda-0000 (latest state: TASK_KILLED, status
update state: TASK_KILLED)
I0405 15:23:55.352011 16460 slave.cpp:6574] Shutting down executor '13a1cb3a-1f23-4cbb-bc03-8e3cc8c5f5ed'
of framework f1432ba7-03c7-4d28-82b1-7934de858cda-0000 at executor(1)@10.3.1.8:57221
I0405 15:23:55.353013 16460 slave.cpp:923] Agent terminating
W0405 15:23:55.353013 16460 slave.cpp:3873] Ignoring shutdown framework f1432ba7-03c7-4d28-82b1-7934de858cda-0000
because it is terminating
I0405 15:23:55.355010 15828 master.cpp:10548] Removing task 13a1cb3a-1f23-4cbb-bc03-8e3cc8c5f5ed
with resources cpus(allocated: *):4; mem(allocated: *):2048; disk(allocated: *):1024; ports(allocated:
*):[31000-32000] of framework f1432ba7-03c7-4d28-82b1-7934de858cda-0000 on agent f1432ba7-03c7-4d28-82b1-7934de858cda-S0
at slave(418)@10.3.1.8:57200 (winbldsrv-01.zq4gs31qjdiunm1ryi1452nvnh.dx.internal.cloudapp.net)
I0405 15:23:55.356009 10220 containerizer.cpp:2338] Destroying container 19d9b4d6-ae5f-486d-888f-187524ed071a
in RUNNING state
I0405 15:23:55.356009 10220 containerizer.cpp:2952] Transitioning the state of container 19d9b4d6-ae5f-486d-888f-187524ed071a
from RUNNING to DESTROYING
I0405 15:23:55.357038 10220 launcher.cpp:156] Asked to destroy container 19d9b4d6-ae5f-486d-888f-187524ed071a
I0405 15:23:55.358007 15828 master.cpp:1295] Agent f1432ba7-03c7-4d28-82b1-7934de858cda-S0
at slave(418)@10.3.1.8:57200 (winbldsrv-01.zq4gs31qjdiunm1ryi1452nvnh.dx.internal.cloudapp.net)
disconnected
I0405 15:23:55.358007 15828 master.cpp:3286] Disconnecting agent f1432ba7-03c7-4d28-82b1-7934de858cda-S0
at slave(418)@10.3.1.8:57200 (winbldsrv-01.zq4gs31qjdiunm1ryi1452nvnh.dx.internal.cloudapp.net)
I0405 15:23:55.359007 15828 master.cpp:3305] Deactivating agent f1432ba7-03c7-4d28-82b1-7934de858cda-S0
at slave(418)@10.3.1.8:57200 (winbldsrv-01.zq4gs31qjdiunm1ryi1452nvnh.dx.internal.cloudapp.net)
I0405 15:23:55.359007 16460 hierarchical.cpp:344] Removed framework f1432ba7-03c7-4d28-82b1-7934de858cda-0000
I0405 15:23:55.360005 16136 hierarchical.cpp:766] Agent f1432ba7-03c7-4d28-82b1-7934de858cda-S0
deactivated
I0405 15:23:55.420876  4876 containerizer.cpp:2791] Container 19d9b4d6-ae5f-486d-888f-187524ed071a
has exited
I0405 15:23:55.452872 15164 master.cpp:1137] Master terminating
I0405 15:23:55.454869  5512 hierarchical.cpp:609] Removed agent f1432ba7-03c7-4d28-82b1-7934de858cda-S0
I0405 15:23:55.860870  8520 process.cpp:929] Stopped the socket accept loop
```

- Mesos Reviewbot Windows


On April 5, 2018, 2:14 p.m., Benjamin Bannier wrote:
> 
> -----------------------------------------------------------
> This is an automatically generated e-mail. To reply, visit:
> https://reviews.apache.org/r/66476/
> -----------------------------------------------------------
> 
> (Updated April 5, 2018, 2:14 p.m.)
> 
> 
> Review request for mesos, Chun-Hung Hsiao and Jan Schlicht.
> 
> 
> Repository: mesos
> 
> 
> Description
> -------
> 
> This patch changes tests of operations on the resource provider
> manager registrar to make the operations return with a success instead
> of just checking that the future results get ready.
> 
> 
> Diffs
> -----
> 
>   src/tests/resource_provider_manager_tests.cpp 05ae5defb986103520cf630d5578e8a04e662313

> 
> 
> Diff: https://reviews.apache.org/r/66476/diff/1/
> 
> 
> Testing
> -------
> 
> `make check`
> 
> 
> Thanks,
> 
> Benjamin Bannier
> 
>


Mime
  • Unnamed multipart/alternative (inline, None, 0 bytes)
View raw message