mesos-reviews mailing list archives

Site index · List index
Message view « Date » · « Thread »
Top « Date » · « Thread »
From Mesos Reviewbot Windows <revi...@mesos.apache.org>
Subject Re: Review Request 66471: Added stringification for resource provider message type.
Date Thu, 05 Apr 2018 09:44:09 GMT

-----------------------------------------------------------
This is an automatically generated e-mail. To reply, visit:
https://reviews.apache.org/r/66471/#review200543
-----------------------------------------------------------



FAIL: Some of the unit tests failed. Please check the relevant logs.

Reviews applied: `['66471']`

Failed command: `Start-MesosCITesting`

All the build artifacts available at: http://dcos-win.westus.cloudapp.azure.com/mesos-build/review/66471

Relevant logs:

- [mesos-tests-stdout.log](http://dcos-win.westus.cloudapp.azure.com/mesos-build/review/66471/logs/mesos-tests-stdout.log):

```
[       OK ] Endpoint/SlaveEndpointTest.NoAuthorizer/2 (115 ms)
[----------] 9 tests from Endpoint/SlaveEndpointTest (1098 ms total)

[----------] 2 tests from ContainerizerType/DefaultContainerDNSFlagTest
[ RUN      ] ContainerizerType/DefaultContainerDNSFlagTest.ValidateFlag/0
[       OK ] ContainerizerType/DefaultContainerDNSFlagTest.ValidateFlag/0 (45 ms)
[ RUN      ] ContainerizerType/DefaultContainerDNSFlagTest.ValidateFlag/1
[       OK ] ContainerizerType/DefaultContainerDNSFlagTest.ValidateFlag/1 (50 ms)
[----------] 2 tests from ContainerizerType/DefaultContainerDNSFlagTest (97 ms total)

[----------] 1 test from IsolationFlag/CpuIsolatorTest
[ RUN      ] IsolationFlag/CpuIsolatorTest.ROOT_UserCpuUsage/0
[       OK ] IsolationFlag/CpuIsolatorTest.ROOT_UserCpuUsage/0 (744 ms)
[----------] 1 test from IsolationFlag/CpuIsolatorTest (769 ms total)

[----------] 1 test from IsolationFlag/MemoryIsolatorTest
[ RUN      ] IsolationFlag/MemoryIsolatorTest.ROOT_MemUsage/0
[       OK ] IsolationFlag/MemoryIsolatorTest.ROOT_MemUsage/0 (841 ms)
[----------] 1 test from IsolationFlag/MemoryIsolatorTest (868 ms total)

[----------] Global test environment tear-down
[==========] 949 tests from 94 test cases ran. (450660 ms total)
[  PASSED  ] 948 tests.
[  FAILED  ] 1 test, listed below:
[  FAILED  ] CommandExecutorCheckTest.CommandCheckTimeout

 1 FAILED TEST
  YOU HAVE 214 DISABLED TESTS

```

- [mesos-tests-stderr.log](http://dcos-win.westus.cloudapp.azure.com/mesos-build/review/66471/logs/mesos-tests-stderr.log):

```
I0405 09:43:56.038856 15188 master.cpp:10449] Updating the state of task c27652d7-8d0e-45bd-93f4-a1528e05f8a2
of framework fa998259-f91d-44fe-b4d7-af382bf4aac6-0000 (latest state: TASK_KILLED, status
update state: TASK_KILLED)
I0405 09:43:56.038856 11060 slave.cpp:3877] Shutting down framework fa998259-f91d-44fe-b4d7-af382bf4aac6-0000
I0405 09:43:56.038856 11060 slave.cpp:6574] Shutting down executor 'c27652d7-8d0e-45bd-93f4-a1528e05f8a2'
of framework fa998259-f91d-44fe-b4d7-af382bf4aac6-0000 at executor(1)@10.3.1.8:64524
I0405 09:43:56.038856  8012 slave.cpp:923] Agent terminating
W0405 09:43:56.038856  8012 slave.cpp:3873] Ignoring shutdown I0405 09:43:55.850879  5704
exec.cpp:162] Version: 1.6.0
I0405 09:43:55.876843 15176 exec.cpp:236] Executor registered on agent fa998259-f91d-44fe-b4d7-af382bf4aac6-S0
I0405 09:43:55.880893  6056 executor.cpp:176] Received SUBSCRIBED event
I0405 09:43:55.885879  6056 executor.cpp:180] Subscribed executor on winbldsrv-01.zq4gs31qjdiunm1ryi1452nvnh.dx.internal.cloudapp.net
I0405 09:43:55.885879  6056 executor.cpp:176] Received LAUNCH event
I0405 09:43:55.891913  6056 executor.cpp:648] Starting task c27652d7-8d0e-45bd-93f4-a1528e05f8a2
I0405 09:43:55.977883  6056 executor.cpp:483] Running 'D:\DCOS\mesos\src\mesos-containerizer.exe
launch <POSSIBLY-SENSITIVE-DATA>'
I0405 09:43:56.009865  6056 executor.cpp:661] Forked command at 15152
I0405 09:43:56.038856 14824 exec.cpp:445] Executor asked to shutdown
I0405 09:43:56.038856  6336 executor.cpp:176] Received SHUTDOWN event
I0405 09:43:56.038856  6336 executor.cpp:758] Shutting down
I0405 09:43:56.038856  6336 executor.cpp:868] Sending SIGTERM to process tree at pid framework
fa998259-f91d-44fe-b4d7-af382bf4aac6-0000 because it is terminating
I0405 09:43:56.038856 15188 master.cpp:10548] Removing task c27652d7-8d0e-45bd-93f4-a1528e05f8a2
with resources cpus(allocated: *):4; mem(allocated: *):2048; disk(allocated: *):1024; ports(allocated:
*):[31000-32000] of framework fa998259-f91d-44fe-b4d7-af382bf4aac6-0000 on agent fa998259-f91d-44fe-b4d7-af382bf4aac6-S0
at slave(418)@10.3.1.8:64503 (winbldsrv-01.zq4gs31qjdiunm1ryi1452nvnh.dx.internal.cloudapp.net)
I0405 09:43:56.043845 15188 master.cpp:1295] Agent fa998259-f91d-44fe-b4d7-af382bf4aac6-S0
at slave(418)@10.3.1.8:64503 (winbldsrv-01.zq4gs31qjdiunm1ryi1452nvnh.dx.internal.cloudapp.net)
disconnected
I0405 09:43:56.043845 15188 master.cpp:3286] Disconnecting agent fa998259-f91d-44fe-b4d7-af382bf4aac6-S0
at slave(418)@10.3.1.8:64503 (winbldsrv-01.zq4gs31qjdiunm1ryi1452nvnh.dx.internal.cloudapp.net)
I0405 09:43:56.043845 15188 master.cpp:3305] Deactivating agent fa998259-f91d-44fe-b4d7-af382bf4aac6-S0
at slave(418)@10.3.1.8:64503 (winbldsrv-01.zq4gs31qjdiunm1ryi1452nvnh.dx.internal.cloudapp.net)
I0405 09:43:56.043845 10576 hierarchical.cpp:344] Removed framework fa998259-f91d-44fe-b4d7-af382bf4aac6-0000
I0405 09:43:56.043845 10576 hierarchical.cpp:766] Agent fa998259-f91d-44fe-b4d7-af382bf4aac6-S0
deactivated
I0405 09:43:56.043845 11324 containerizer.cpp:2338] Destroying container 5433eb93-fbec-4791-b353-d418dea34517
in RUNNING state
I0405 09:43:56.043845 11324 containerizer.cpp:2952] Transitioning the state of container 5433eb93-fbec-4791-b353-d418dea34517
from RUNNING to DESTROYING
I0405 09:43:56.043845 11324 launcher.cpp:156] Asked to destroy container 5433eb93-fbec-4791-b353-d418dea34517
I0405 09:43:56.120940  8820 containerizer.cpp:2791] Container 5433eb93-fbec-4791-b353-d418dea34517
has exited
I0405 09:43:56.155908  8012 master.cpp:1137] Master terminating
I0405 09:43:56.157905  8340 hierarchical.cpp:609] Removed agent fa998259-f91d-44fe-b4d7-af382bf4aac6-S0
I0405 09:43:56.639922  6384 process.cpp:929] Stopped the socket accept loop
```

- Mesos Reviewbot Windows


On April 5, 2018, 8:48 a.m., Benjamin Bannier wrote:
> 
> -----------------------------------------------------------
> This is an automatically generated e-mail. To reply, visit:
> https://reviews.apache.org/r/66471/
> -----------------------------------------------------------
> 
> (Updated April 5, 2018, 8:48 a.m.)
> 
> 
> Review request for mesos, Chun-Hung Hsiao and Jan Schlicht.
> 
> 
> Repository: mesos
> 
> 
> Description
> -------
> 
> Added stringification for resource provider message type.
> 
> 
> Diffs
> -----
> 
>   src/resource_provider/message.hpp ae752fcc039e901f87dd130f7819657903e6d08d 
> 
> 
> Diff: https://reviews.apache.org/r/66471/diff/1/
> 
> 
> Testing
> -------
> 
> `make check`
> 
> 
> Thanks,
> 
> Benjamin Bannier
> 
>


Mime
  • Unnamed multipart/alternative (inline, None, 0 bytes)
View raw message