mesos-reviews mailing list archives

Site index · List index
Message view « Date » · « Thread »
Top « Date » · « Thread »
From Mesos Reviewbot Windows <revi...@mesos.apache.org>
Subject Re: Review Request 64211: Added options to build the Python CLI and run unit tests.
Date Sat, 24 Mar 2018 12:35:20 GMT

-----------------------------------------------------------
This is an automatically generated e-mail. To reply, visit:
https://reviews.apache.org/r/64211/#review199927
-----------------------------------------------------------



FAIL: Some of the unit tests failed. Please check the relevant logs.

Reviews applied: `['65585', '65705', '64211']`

Failed command: `Start-MesosCITesting`

All the build artifacts available at: http://dcos-win.westus.cloudapp.azure.com/mesos-build/review/64211

Relevant logs:

- [mesos-tests-stdout.log](http://dcos-win.westus.cloudapp.azure.com/mesos-build/review/64211/logs/mesos-tests-stdout.log):

```
[       OK ] Endpoint/SlaveEndpointTest.NoAuthorizer/2 (112 ms)
[----------] 9 tests from Endpoint/SlaveEndpointTest (1053 ms total)

[----------] 2 tests from ContainerizerType/DefaultContainerDNSFlagTest
[ RUN      ] ContainerizerType/DefaultContainerDNSFlagTest.ValidateFlag/0
[       OK ] ContainerizerType/DefaultContainerDNSFlagTest.ValidateFlag/0 (32 ms)
[ RUN      ] ContainerizerType/DefaultContainerDNSFlagTest.ValidateFlag/1
[       OK ] ContainerizerType/DefaultContainerDNSFlagTest.ValidateFlag/1 (36 ms)
[----------] 2 tests from ContainerizerType/DefaultContainerDNSFlagTest (70 ms total)

[----------] 1 test from IsolationFlag/CpuIsolatorTest
[ RUN      ] IsolationFlag/CpuIsolatorTest.ROOT_UserCpuUsage/0
[       OK ] IsolationFlag/CpuIsolatorTest.ROOT_UserCpuUsage/0 (836 ms)
[----------] 1 test from IsolationFlag/CpuIsolatorTest (861 ms total)

[----------] 1 test from IsolationFlag/MemoryIsolatorTest
[ RUN      ] IsolationFlag/MemoryIsolatorTest.ROOT_MemUsage/0
[       OK ] IsolationFlag/MemoryIsolatorTest.ROOT_MemUsage/0 (847 ms)
[----------] 1 test from IsolationFlag/MemoryIsolatorTest (872 ms total)

[----------] Global test environment tear-down
[==========] 949 tests from 94 test cases ran. (453926 ms total)
[  PASSED  ] 948 tests.
[  FAILED  ] 1 test, listed below:
[  FAILED  ] CommandExecutorCheckTest.CommandCheckTimeout

 1 FAILED TEST
  YOU HAVE 215 DISABLED TESTS

```

- [mesos-tests-stderr.log](http://dcos-win.westus.cloudapp.azure.com/mesos-build/review/64211/logs/mesos-tests-stderr.log):

```
I0324 12:35:06.961160 11920 slave.cpp:3873] Shutting down framework 45f5200c-1e0e-44b7-82d6-12c70863beca-0000
I0324 12:35:06.961160  7124 master.cpp:10446] Updating the state of task c5cc28d7-fb9d-425a-bcd2-bd05be1c3945
of framework 45f5200c-1e0e-44b7-82d6-12c70863beca-0000 (latest state: TASK_KILLED, status
update state: TASK_KILLED)
I0324 12:35:06.961160 11920 slave.cpp:6566] Shutting down executor 'c5cc28d7-fb9d-425a-bcd2-bd05be1c3945'
of framework 45f5200c-1e0e-44b7-82d6-12c70863beca-0000 at executor(1)@10.3.1.8:63641
I0324 12:35:06.963160  3800 slave.cpp:919] Agent terminating
W0324 12:35:06.963160  3800 slave.cpp:3869] Ignoring shutdown framework 45f5200c-1e0e-44b7-82d6-12c70863beca-0000
because it is terminatingI0324 12:35:06.775140 10992 exec.cpp:162] Version: 1.6.0
I0324 12:35:06.803160  9036 exec.cpp:236] Executor registered on agent 45f5200c-1e0e-44b7-82d6-12c70863beca-S0
I0324 12:35:06.808157 10988 executor.cpp:176] Received SUBSCRIBED event
I0324 12:35:06.813143 10988 executor.cpp:180] Subscribed executor on winbldsrv-01.zq4gs31qjdiunm1ryi1452nvnh.dx.internal.cloudapp.net
I0324 12:35:06.813143 10988 executor.cpp:176] Received LAUNCH event
I0324 12:35:06.819193 10988 executor.cpp:648] Starting task c5cc28d7-fb9d-425a-bcd2-bd05be1c3945
I0324 12:35:06.897177 10988 executor.cpp:483] Running 'D:\DCOS\mesos\src\mesos-containerizer.exe
launch <POSSIBLY-SENSITIVE-DATA>'
I0324 12:35:06.931155 10988 executor.cpp:661] Forked command at 8420
I0324 12:35:06.963160   912 exec.cpp:445] Executor asked to shutdown
I0324 12:35:06.964166  9324 executor.cpp:176] Received SHUTDOWN event
I0324 12:35:06.964166  9324 executor.cpp:758] Shutting down
I0324 12:35:06.964166  9324 executor.cpp:868] Sending SIGTERM to process tree at pid 8
I0324 12:35:06.964166  7124 master.cpp:10545] Removing task c5cc28d7-fb9d-425a-bcd2-bd05be1c3945
with resources cpus(allocated: *):4; mem(allocated: *):2048; disk(allocated: *):1024; ports(allocated:
*):[31000-32000] of framework 45f5200c-1e0e-44b7-82d6-12c70863beca-0000 on agent 45f5200c-1e0e-44b7-82d6-12c70863beca-S0
at slave(418)@10.3.1.8:63620 (winbldsrv-01.zq4gs31qjdiunm1ryi1452nvnh.dx.internal.cloudapp.net)
I0324 12:35:06.968169  7124 master.cpp:1295] Agent 45f5200c-1e0e-44b7-82d6-12c70863beca-S0
at slave(418)@10.3.1.8:63620 (winbldsrv-01.zq4gs31qjdiunm1ryi1452nvnh.dx.internal.cloudapp.net)
disconnected
I0324 12:35:06.968169  7124 master.cpp:3283] Disconnecting agent 45f5200c-1e0e-44b7-82d6-12c70863beca-S0
at slave(418)@10.3.1.8:63620 (winbldsrv-01.zq4gs31qjdiunm1ryi1452nvnh.dx.internal.cloudapp.net)
I0324 12:35:06.968169  7124 master.cpp:3302] Deactivating agent 45f5200c-1e0e-44b7-82d6-12c70863beca-S0
at slave(418)@10.3.1.8:63620 (winbldsrv-01.zq4gs31qjdiunm1ryi1452nvnh.dx.internal.cloudapp.net)
I0324 12:35:06.969169  6560 containerizer.cpp:2338] Destroying container 69905e0c-ebd6-4d9b-b0a1-6c70628635e4
in RUNNING state
I0324 12:35:06.969169  6672 hierarchical.cpp:344] Removed framework 45f5200c-1e0e-44b7-82d6-12c70863beca-0000
I0324 12:35:06.969169  6672 hierarchical.cpp:766] Agent 45f5200c-1e0e-44b7-82d6-12c70863beca-S0
deactivated
I0324 12:35:06.970301  6560 containerizer.cpp:2952] Transitioning the state of container 69905e0c-ebd6-4d9b-b0a1-6c70628635e4
from RUNNING to DESTROYING
I0324 12:35:06.971165  6560 launcher.cpp:156] Asked to destroy container 69905e0c-ebd6-4d9b-b0a1-6c70628635e4
I0324 12:35:07.066629  1928 containerizer.cpp:2791] Container 69905e0c-ebd6-4d9b-b0a1-6c70628635e4
has exited
I0324 12:35:07.105247 11320 master.cpp:1137] Master terminating
I0324 12:35:07.107247  8296 hierarchical.cpp:609] Removed agent 45f5200c-1e0e-44b7-82d6-12c70863beca-S0
I0324 12:35:07.488262  9868 process.cpp:929] Stopped the socket accept loop
```

- Mesos Reviewbot Windows


On March 24, 2018, 11:39 a.m., Armand Grillet wrote:
> 
> -----------------------------------------------------------
> This is an automatically generated e-mail. To reply, visit:
> https://reviews.apache.org/r/64211/
> -----------------------------------------------------------
> 
> (Updated March 24, 2018, 11:39 a.m.)
> 
> 
> Review request for mesos, Benjamin Bannier and Kevin Klues.
> 
> 
> Bugs: MESOS-8240
>     https://issues.apache.org/jira/browse/MESOS-8240
> 
> 
> Repository: mesos
> 
> 
> Description
> -------
> 
> An update of the discarded review /r/52543.
> 
> Works with Autotools and CMake.
> 
> 
> Diffs
> -----
> 
>   CMakeLists.txt 6702f02245e3867c06bbd9efbbf4e3b961a7d9aa 
>   cmake/CompilationConfigure.cmake 64cc56ee4208afe05df0f28af5890157e4c7d82c 
>   configure.ac f0f901f2e565352c2804cae7b2ac255da81ce45d 
>   docs/configuration/cmake.md 1e34657ea55fa324f65f865f7d0a67084c6719d9 
>   src/CMakeLists.txt 3b04e6353979c05a38f1b032704dce566d8fd561 
>   src/Makefile.am a570c9f47f6de73c689930ae020fefb29b30b32d 
>   src/python/cli_new/CMakeLists.txt PRE-CREATION 
>   src/python/cli_new/tests/CMakeLists.txt PRE-CREATION 
> 
> 
> Diff: https://reviews.apache.org/r/64211/diff/15/
> 
> 
> Testing
> -------
> 
> Testing done on Fedora 25.
> 
> For Autotools:
> ```
> $ ./bootstrap
> $ mkdir build
> $ cd build
> $ ../configure --enable-new-cli --disable-java --disable-python
> $ make check
> ```
> 
> For CMake:
> ```
> $ ./bootstrap
> $ mkdir build
> $ cd build
> $ cmake .. -DENABLE_NEW_CLI=1
> $ cmake --build . -- -j16
> $ ./src/mesos
> Mesos CLI
> 
> Usage:
>   mesos (-h | --help)
>   mesos --version
>   mesos <command> [<args>...]
> 
> Options:
>   -h --help  Show this screen.
>   --version  Show version info.
> 
> Commands:
>   agent   Interacts with the Mesos agents
>   config  Interacts with the Mesos CLI configuration file
>   task    Interacts with the tasks running in a Mesos cluster
> 
> See 'mesos help <command>' for more information on a specific command.
> $ cmake --build . --target tests -- -j16
> $ ctest -R CLI
> Test project /home/agrillet/apache-mesos/build
>     Start 4: CLITests
> 1/1 Test #4: CLITests .........................   Passed    3.63 sec
> 
> 100% tests passed, 0 tests failed out of 1
> ```
> 
> Checked that the the CLI tests were run, that the content of the directory `build/src/cli`
was as expected, and that `build/src/mesos` was correctly running.
> 
> 
> Thanks,
> 
> Armand Grillet
> 
>


Mime
  • Unnamed multipart/alternative (inline, None, 0 bytes)
View raw message