mesos-reviews mailing list archives

Site index · List index
Message view « Date » · « Thread »
Top « Date » · « Thread »
From Mesos Reviewbot Windows <revi...@mesos.apache.org>
Subject Re: Review Request 66173: Add test for new `disk/xfs` kill functionality.
Date Thu, 22 Mar 2018 16:04:16 GMT

-----------------------------------------------------------
This is an automatically generated e-mail. To reply, visit:
https://reviews.apache.org/r/66173/#review199768
-----------------------------------------------------------



FAIL: Some of the unit tests failed. Please check the relevant logs.

Reviews applied: `['66001', '66173']`

Failed command: `Start-MesosCITesting`

All the build artifacts available at: http://dcos-win.westus.cloudapp.azure.com/mesos-build/review/66173

Relevant logs:

- [mesos-tests-stdout.log](http://dcos-win.westus.cloudapp.azure.com/mesos-build/review/66173/logs/mesos-tests-stdout.log):

```
[       OK ] Endpoint/SlaveEndpointTest.NoAuthorizer/2 (106 ms)
[----------] 9 tests from Endpoint/SlaveEndpointTest (1047 ms total)

[----------] 2 tests from ContainerizerType/DefaultContainerDNSFlagTest
[ RUN      ] ContainerizerType/DefaultContainerDNSFlagTest.ValidateFlag/0
[       OK ] ContainerizerType/DefaultContainerDNSFlagTest.ValidateFlag/0 (33 ms)
[ RUN      ] ContainerizerType/DefaultContainerDNSFlagTest.ValidateFlag/1
[       OK ] ContainerizerType/DefaultContainerDNSFlagTest.ValidateFlag/1 (36 ms)
[----------] 2 tests from ContainerizerType/DefaultContainerDNSFlagTest (71 ms total)

[----------] 1 test from IsolationFlag/CpuIsolatorTest
[ RUN      ] IsolationFlag/CpuIsolatorTest.ROOT_UserCpuUsage/0
[       OK ] IsolationFlag/CpuIsolatorTest.ROOT_UserCpuUsage/0 (845 ms)
[----------] 1 test from IsolationFlag/CpuIsolatorTest (866 ms total)

[----------] 1 test from IsolationFlag/MemoryIsolatorTest
[ RUN      ] IsolationFlag/MemoryIsolatorTest.ROOT_MemUsage/0
[       OK ] IsolationFlag/MemoryIsolatorTest.ROOT_MemUsage/0 (845 ms)
[----------] 1 test from IsolationFlag/MemoryIsolatorTest (869 ms total)

[----------] Global test environment tear-down
[==========] 943 tests from 94 test cases ran. (449665 ms total)
[  PASSED  ] 942 tests.
[  FAILED  ] 1 test, listed below:
[  FAILED  ] CommandExecutorCheckTest.CommandCheckTimeout

 1 FAILED TEST
  YOU HAVE 215 DISABLED TESTS

```

- [mesos-tests-stderr.log](http://dcos-win.westus.cloudapp.azure.com/mesos-build/review/66173/logs/mesos-tests-stderr.log):

```
I0322 16:04:02.558601  9632 executor.cpp:176] Received SUBSCRIBED event
I0322 16:04:02.564640  9632 executor.cpp:180] Subscribed executor on winbldsrv-02.zq4gs31qjdiunm1ryi1452nvnh.dx.internal.cloudapp.net
I0322 16:04:02.564640  9632 executor.cpp:176] Received LAUNCH event
I0322 16:04:02.569643  9632 executor.cpp:648] Starting task 9da36786-a9cb-4dca-80e8-3fd70f70aeb2
I0322 16:04:02.656664  9632 executor.cpp:483] Running 'D:\DCOS\mesos\src\mesos-containerizer.exe
launch <POSSIBLY-SENSITIVE-DATA>'
I0322 16:04:02.690618  9632 executor.cpp:661] Forked command at 9704
I0322 16:04:02.726619  6328 exec.cpp:445] Executor asked to shutdown
I0322 16:04:02.727617  9636 executor.cpp:176] Received SHUTDOWN event
I0322 16:04:02.727617  9636 executor.cpp:758] Shutting down
I0322 16:04:02.727617  9636 executor.cpp:868] Sending SIGTERM to process tree at pid 9ting
framework 0d1a8e2e-23df-472e-b708-a53a3214112c-0000 (default) at scheduler-b0382659-809e-40ae-b1c1-4d75be9198b4@10.3.1.5:58689
I0322 16:04:02.724619  6960 hierarchical.cpp:405] Deactivated framework 0d1a8e2e-23df-472e-b708-a53a3214112c-0000
I0322 16:04:02.724619  4372 master.cpp:10255] Updating the state of task 9da36786-a9cb-4dca-80e8-3fd70f70aeb2
of framework 0d1a8e2e-23df-472e-b708-a53a3214112c-0000 (latest state: TASK_KILLED, status
update state: TASK_KILLED)
I0322 16:04:02.724619  4552 slave.cpp:3873] Shutting down framework 0d1a8e2e-23df-472e-b708-a53a3214112c-0000
I0322 16:04:02.724619  4552 slave.cpp:6566] Shutting down executor '9da36786-a9cb-4dca-80e8-3fd70f70aeb2'
of framework 0d1a8e2e-23df-472e-b708-a53a3214112c-0000 at executor(1)@10.3.1.5:58710
I0322 16:04:02.725618  4552 slave.cpp:919] Agent terminating
W0322 16:04:02.725618  4552 slave.cpp:3869] Ignoring shutdown framework 0d1a8e2e-23df-472e-b708-a53a3214112c-0000
because it is terminating
I0322 16:04:02.727617  4372 master.cpp:10354] Removing task 9da36786-a9cb-4dca-80e8-3fd70f70aeb2
with resources cpus(allocated: *):4; mem(allocated: *):2048; disk(allocated: *):1024; ports(allocated:
*):[31000-32000] of framework 0d1a8e2e-23df-472e-b708-a53a3214112c-0000 on agent 0d1a8e2e-23df-472e-b708-a53a3214112c-S0
at slave(412)@10.3.1.5:58689 (winbldsrv-02.zq4gs31qjdiunm1ryi1452nvnh.dx.internal.cloudapp.net)
I0322 16:04:02.729619  6960 containerizer.cpp:2338] Destroying container 7e5bc628-8dd2-4cc3-bbac-60611d441d5d
in RUNNING state
I0322 16:04:02.729619  6960 containerizer.cpp:2952] Transitioning the state of container 7e5bc628-8dd2-4cc3-bbac-60611d441d5d
from RUNNING to DESTROYING
I0322 16:04:02.730612  4372 master.cpp:1295] Agent 0d1a8e2e-23df-472e-b708-a53a3214112c-S0
at slave(412)@10.3.1.5:58689 (winbldsrv-02.zq4gs31qjdiunm1ryi1452nvnh.dx.internal.cloudapp.net)
disconnected
I0322 16:04:02.730612  6960 launcher.cpp:156] Asked to destroy container 7e5bc628-8dd2-4cc3-bbac-60611d441d5d
I0322 16:04:02.730612  4372 master.cpp:3283] Disconnecting agent 0d1a8e2e-23df-472e-b708-a53a3214112c-S0
at slave(412)@10.3.1.5:58689 (winbldsrv-02.zq4gs31qjdiunm1ryi1452nvnh.dx.internal.cloudapp.net)
I0322 16:04:02.731633  8124 hierarchical.cpp:344] Removed framework 0d1a8e2e-23df-472e-b708-a53a3214112c-0000
I0322 16:04:02.731633  4372 master.cpp:3302] Deactivating agent 0d1a8e2e-23df-472e-b708-a53a3214112c-S0
at slave(412)@10.3.1.5:58689 (winbldsrv-02.zq4gs31qjdiunm1ryi1452nvnh.dx.internal.cloudapp.net)
I0322 16:04:02.731633  7028 hierarchical.cpp:766] Agent 0d1a8e2e-23df-472e-b708-a53a3214112c-S0
deactivated
I0322 16:04:02.842164  1732 containerizer.cpp:2791] Container 7e5bc628-8dd2-4cc3-bbac-60611d441d5d
has exited
I0322 16:04:02.875162  6696 master.cpp:1137] Master terminating
I0322 16:04:02.877163  4372 hierarchical.cpp:609] Removed agent 0d1a8e2e-23df-472e-b708-a53a3214112c-S0
I0322 16:04:03.327116  5004 process.cpp:929] Stopped the socket accept loop
```

- Mesos Reviewbot Windows


On March 22, 2018, 7:11 a.m., Harold Dost wrote:
> 
> -----------------------------------------------------------
> This is an automatically generated e-mail. To reply, visit:
> https://reviews.apache.org/r/66173/
> -----------------------------------------------------------
> 
> (Updated March 22, 2018, 7:11 a.m.)
> 
> 
> Review request for mesos and James Peach.
> 
> 
> Bugs: MESOS-6575
>     https://issues.apache.org/jira/browse/MESOS-6575
> 
> 
> Repository: mesos
> 
> 
> Description
> -------
> 
> MESOS-6575
> 
> 
> Diffs
> -----
> 
>   src/tests/containerizer/xfs_quota_tests.cpp 64c3e1c3f0bc435897626cb0a13bc19c7cb1a4fe

> 
> 
> Diff: https://reviews.apache.org/r/66173/diff/2/
> 
> 
> Testing
> -------
> 
> 
> Thanks,
> 
> Harold Dost
> 
>


Mime
  • Unnamed multipart/alternative (inline, None, 0 bytes)
View raw message