mesos-reviews mailing list archives

Site index · List index
Message view « Date » · « Thread »
Top « Date » · « Thread »
From Mesos Reviewbot Windows <revi...@mesos.apache.org>
Subject Re: Review Request 66057: Added a `createCallAcknowledgeOperationStatus()` test helper.
Date Wed, 14 Mar 2018 10:13:55 GMT

-----------------------------------------------------------
This is an automatically generated e-mail. To reply, visit:
https://reviews.apache.org/r/66057/#review199158
-----------------------------------------------------------



FAIL: Some of the unit tests failed. Please check the relevant logs.

Reviews applied: `['63991', '63992', '63994', '65300', '64618', '65993', '65994', '66056',
'66057']`

Failed command: `Start-MesosCITesting`

All the build artifacts available at: http://dcos-win.westus.cloudapp.azure.com/mesos-build/review/66057

Relevant logs:

- [mesos-tests-stdout.log](http://dcos-win.westus.cloudapp.azure.com/mesos-build/review/66057/logs/mesos-tests-stdout.log):

```
[       OK ] Endpoint/SlaveEndpointTest.NoAuthorizer/2 (134 ms)
[----------] 9 tests from Endpoint/SlaveEndpointTest (1181 ms total)

[----------] 2 tests from ContainerizerType/DefaultContainerDNSFlagTest
[ RUN      ] ContainerizerType/DefaultContainerDNSFlagTest.ValidateFlag/0
[       OK ] ContainerizerType/DefaultContainerDNSFlagTest.ValidateFlag/0 (42 ms)
[ RUN      ] ContainerizerType/DefaultContainerDNSFlagTest.ValidateFlag/1
[       OK ] ContainerizerType/DefaultContainerDNSFlagTest.ValidateFlag/1 (47 ms)
[----------] 2 tests from ContainerizerType/DefaultContainerDNSFlagTest (91 ms total)

[----------] 1 test from IsolationFlag/CpuIsolatorTest
[ RUN      ] IsolationFlag/CpuIsolatorTest.ROOT_UserCpuUsage/0
[       OK ] IsolationFlag/CpuIsolatorTest.ROOT_UserCpuUsage/0 (2585 ms)
[----------] 1 test from IsolationFlag/CpuIsolatorTest (2610 ms total)

[----------] 1 test from IsolationFlag/MemoryIsolatorTest
[ RUN      ] IsolationFlag/MemoryIsolatorTest.ROOT_MemUsage/0
[       OK ] IsolationFlag/MemoryIsolatorTest.ROOT_MemUsage/0 (2470 ms)
[----------] 1 test from IsolationFlag/MemoryIsolatorTest (2496 ms total)

[----------] Global test environment tear-down
[==========] 920 tests from 91 test cases ran. (465971 ms total)
[  PASSED  ] 919 tests.
[  FAILED  ] 1 test, listed below:
[  FAILED  ] SlaveTest.RestartSlaveRequireExecutorAuthentication

 1 FAILED TEST
  YOU HAVE 210 DISABLED TESTS

```

- [mesos-tests-stderr.log](http://dcos-win.westus.cloudapp.azure.com/mesos-build/review/66057/logs/mesos-tests-stderr.log):

```
I0314 10:13:40.181313 10980 slave.cpp:3878] Shutting down framework 771ab81f-6499-41be-abd8-06bf1e687987-0000
I0I0314 10:13:39.473310  8144 exec.cpp:162] Version: 1.6.0
I0314 10:13:39.502307  4408 exec.cpp:236] Executor registered on agent 771ab81f-6499-41be-abd8-06bf1e687987-S0
I0314 10:13:39.507314  6808 executor.cpp:176] Received SUBSCRIBED event
I0314 10:13:39.512334  6808 executor.cpp:180] Subscribed executor on build-srv-04.zq4gs31qjdiunm1ryi1452nvnh.dx.internal.cloudapp.net
I0314 10:13:39.512334  6808 executor.cpp:176] Received LAUNCH event
I0314 10:13:39.517334  6808 executor.cpp:648] Starting task f0c599cf-7811-4d7e-bba4-1b90ce834218
I0314 10:13:39.599334  6808 executor.cpp:483] Running 'D:\DCOS\mesos\src\mesos-containerizer.exe
launch <POSSIBLY-SENSITIVE-DATA>'
I0314 10:13:40.145311  6808 executor.cpp:661] Forked command at 6672
I0314 10:13:40.185312  9212 exec.cpp:445] Executor asked to shutdown
I0314 10:13:40.186312  6808 executor.cpp:176] Received SHUTDOWN event
I0314 10:13:40.186312  6808 executor.cpp:758] Shutting down
I0314 10:13:40.186312  6808 executor.cpp:868] Sending SIGTERM to process tree at pid 6314
10:13:40.181313 10816 master.cpp:10414] Updating the state of task f0c599cf-7811-4d7e-bba4-1b90ce834218
of framework 771ab81f-6499-41be-abd8-06bf1e687987-0000 (latest state: TASK_KILLED, status
update state: TASK_KILLED)
I0314 10:13:40.181313 10980 slave.cpp:6571] Shutting down executor 'f0c599cf-7811-4d7e-bba4-1b90ce834218'
of framework 771ab81f-6499-41be-abd8-06bf1e687987-0000 at executor(1)@10.3.1.5:58388
I0314 10:13:40.183312 10980 slave.cpp:924] Agent terminating
W0314 10:13:40.184314 10980 slave.cpp:3874] Ignoring shutdown framework 771ab81f-6499-41be-abd8-06bf1e687987-0000
because it is terminating
I0314 10:13:40.186312 10816 master.cpp:10513] Removing task f0c599cf-7811-4d7e-bba4-1b90ce834218
with resources cpus(allocated: *):4; mem(allocated: *):2048; disk(allocated: *):1024; ports(allocated:
*):[31000-32000] of framework 771ab81f-6499-41be-abd8-06bf1e687987-0000 on agent 771ab81f-6499-41be-abd8-06bf1e687987-S0
at slave(402)@10.3.1.5:58367 (build-srv-04.zq4gs31qjdiunm1ryi1452nvnh.dx.internal.cloudapp.net)
I0314 10:13:40.187317 10980 containerizer.cpp:2338] Destroying container c4d2ec9a-e4bd-4452-a5ec-51266c3f1f63
in RUNNING state
I0314 10:13:40.188315 10980 containerizer.cpp:2952] Transitioning the state of container c4d2ec9a-e4bd-4452-a5ec-51266c3f1f63
from RUNNING to DESTROYING
I0314 10:13:40.189314 10980 launcher.cpp:156] Asked to destroy container c4d2ec9a-e4bd-4452-a5ec-51266c3f1f63
I0314 10:13:40.190312 10816 master.cpp:1288] Agent 771ab81f-6499-41be-abd8-06bf1e687987-S0
at slave(402)@10.3.1.5:58367 (build-srv-04.zq4gs31qjdiunm1ryi1452nvnh.dx.internal.cloudapp.net)
disconnected
I0314 10:13:40.190312 10816 master.cpp:3258] Disconnecting agent 771ab81f-6499-41be-abd8-06bf1e687987-S0
at slave(402)@10.3.1.5:58367 (build-srv-04.zq4gs31qjdiunm1ryi1452nvnh.dx.internal.cloudapp.net)
I0314 10:13:40.191313 10816 master.cpp:3277] Deactivating agent 771ab81f-6499-41be-abd8-06bf1e687987-S0
at slave(402)@10.3.1.5:58367 (build-srv-04.zq4gs31qjdiunm1ryi1452nvnh.dx.internal.cloudapp.net)
I0314 10:13:40.191313 11916 hierarchical.cpp:344] Removed framework 771ab81f-6499-41be-abd8-06bf1e687987-0000
I0314 10:13:40.192314 11916 hierarchical.cpp:766] Agent 771ab81f-6499-41be-abd8-06bf1e687987-S0
deactivated
I0314 10:13:40.229315  2984 containerizer.cpp:2791] Container c4d2ec9a-e4bd-4452-a5ec-51266c3f1f63
has exited
I0314 10:13:40.268318  9480 master.cpp:1131] Master terminating
I0314 10:13:40.270315 11916 hierarchical.cpp:609] Removed agent 771ab81f-6499-41be-abd8-06bf1e687987-S0
I0314 10:13:40.754503  2496 process.cpp:929] Stopped the socket accept loop
```

- Mesos Reviewbot Windows


On March 14, 2018, 9:08 a.m., Gaston Kleiman wrote:
> 
> -----------------------------------------------------------
> This is an automatically generated e-mail. To reply, visit:
> https://reviews.apache.org/r/66057/
> -----------------------------------------------------------
> 
> (Updated March 14, 2018, 9:08 a.m.)
> 
> 
> Review request for mesos and Greg Mann.
> 
> 
> Bugs: MESOS-8201
>     https://issues.apache.org/jira/browse/MESOS-8201
> 
> 
> Repository: mesos
> 
> 
> Description
> -------
> 
> Added a `createCallAcknowledgeOperationStatus()` test helper.
> 
> 
> Diffs
> -----
> 
>   src/tests/mesos.hpp 2c3d0c9350bbbbcd2223ff20c0797d1849d38c19 
> 
> 
> Diff: https://reviews.apache.org/r/66057/diff/2/
> 
> 
> Testing
> -------
> 
> Used by the tests added in https://reviews.apache.org/r/66060/.
> 
> 
> Thanks,
> 
> Gaston Kleiman
> 
>


Mime
  • Unnamed multipart/alternative (inline, None, 0 bytes)
View raw message