mesos-reviews mailing list archives

Site index · List index
Message view « Date » · « Thread »
Top « Date » · « Thread »
From Mesos Reviewbot Windows <revi...@mesos.apache.org>
Subject Re: Review Request 65838: Updated validation of 'RAW' and 'BLOCK' disk resources.
Date Wed, 28 Feb 2018 17:21:21 GMT

-----------------------------------------------------------
This is an automatically generated e-mail. To reply, visit:
https://reviews.apache.org/r/65838/#review198397
-----------------------------------------------------------



FAIL: Some of the unit tests failed. Please check the relevant logs.

Reviews applied: `['65838']`

Failed command: `Start-MesosCITesting`

All the build artifacts available at: http://dcos-win.westus.cloudapp.azure.com/mesos-build/review/65838

Relevant logs:

- [mesos-tests-stdout.log](http://dcos-win.westus.cloudapp.azure.com/mesos-build/review/65838/logs/mesos-tests-stdout.log):

```
[       OK ] Endpoint/SlaveEndpointTest.NoAuthorizer/2 (124 ms)
[----------] 9 tests from Endpoint/SlaveEndpointTest (1159 ms total)

[----------] 2 tests from ContainerizerType/DefaultContainerDNSFlagTest
[ RUN      ] ContainerizerType/DefaultContainerDNSFlagTest.ValidateFlag/0
[       OK ] ContainerizerType/DefaultContainerDNSFlagTest.ValidateFlag/0 (37 ms)
[ RUN      ] ContainerizerType/DefaultContainerDNSFlagTest.ValidateFlag/1
[       OK ] ContainerizerType/DefaultContainerDNSFlagTest.ValidateFlag/1 (42 ms)
[----------] 2 tests from ContainerizerType/DefaultContainerDNSFlagTest (83 ms total)

[----------] 1 test from IsolationFlag/CpuIsolatorTest
[ RUN      ] IsolationFlag/CpuIsolatorTest.ROOT_UserCpuUsage/0
[       OK ] IsolationFlag/CpuIsolatorTest.ROOT_UserCpuUsage/0 (2464 ms)
[----------] 1 test from IsolationFlag/CpuIsolatorTest (2490 ms total)

[----------] 1 test from IsolationFlag/MemoryIsolatorTest
[ RUN      ] IsolationFlag/MemoryIsolatorTest.ROOT_MemUsage/0
[       OK ] IsolationFlag/MemoryIsolatorTest.ROOT_MemUsage/0 (2457 ms)
[----------] 1 test from IsolationFlag/MemoryIsolatorTest (2482 ms total)

[----------] Global test environment tear-down
[==========] 915 tests from 90 test cases ran. (481882 ms total)
[  PASSED  ] 914 tests.
[  FAILED  ] 1 test, listed below:
[  FAILED  ] CommandExecutorCheckTest.CommandCheckTimeout

 1 FAILED TEST
  YOU HAVE 211 DISABLED TESTS

```

- [mesos-tests-stderr.log](http://dcos-win.westus.cloudapp.azure.com/mesos-build/review/65838/logs/mesos-tests-stderr.log):

```
I0228 17:21:07.602572  9088 master.cpp:10258] Updating the state of task ad4c1906-4af3-4297-8c8e-3a48d4b76c0e
of framework 7c635dbc-0475-4a94-90ee-67d4ee21ccb1-0000 (latest state: TASK_KILLED, status
update state: TASK_KILLED)
I0228 17:21:07.602572  8792 slave.cpp:3879] Shutting down framework 7c635dbc-0475-4a94-90ee-67d4ee21ccb1-0000
I0228 17:21:07.602572  8792 slave.cpp:6586] Shutting down executor 'ad4c1906-4af3-4297-8c8e-3a48d4b76c0e'
of framework 7c635dbc-0475-4a94-90ee-67d4ee21ccb1-0000 at executor(1)@10.3.1.5:60453
I0228 17:21:07.603581  8792 slave.cpp:922] Agent terminating
W0228 17:21:07.603581  8792 slave.cpp:3875] Ignoring shutdown framework 7c635dbc-0475-4a94-90ee-67d4ee21ccb1-0000
because it is terminating
I0228 17:21:0I0228 17:21:06.900574  3544 exec.cpp:162] Version: 1.6.0
I0228 17:21:06.929574  1036 exec.cpp:236] Executor registered on agent 7c635dbc-0475-4a94-90ee-67d4ee21ccb1-S0
I0228 17:21:06.934571  8392 executor.cpp:176] Received SUBSCRIBED event
I0228 17:21:06.939574  8392 executor.cpp:180] Subscribed executor on build-srv-04.zq4gs31qjdiunm1ryi1452nvnh.dx.internal.cloudapp.net
I0228 17:21:06.939574  8392 executor.cpp:176] Received LAUNCH event
I0228 17:21:06.944573  8392 executor.cpp:648] Starting task ad4c1906-4af3-4297-8c8e-3a48d4b76c0e
I0228 17:21:07.025573  8392 executor.cpp:483] Running 'D:\DCOS\mesos\src\mesos-containerizer.exe
launch <POSSIBLY-SENSITIVE-DATA>'
I0228 17:21:07.566575  8392 executor.cpp:661] Forked command at 9672
I0228 17:21:07.604604  8900 exec.cpp:445] Executor asked to shutdown
I0228 17:21:07.605573  8392 executor.cpp:176] Received SHUTDOWN event
I0228 17:21:07.606578  8392 executor.cpp:758] Shutting down
I0228 17:21:07.606578  8392 executor.cpp:868] Sending SIGTERM to process tree at pid 97.605573
 9088 master.cpp:10357] Removing task ad4c1906-4af3-4297-8c8e-3a48d4b76c0e with resources
cpus(allocated: *):4; mem(allocated: *):2048; disk(allocated: *):1024; ports(allocated: *):[31000-32000]
of framework 7c635dbc-0475-4a94-90ee-67d4ee21ccb1-0000 on agent 7c635dbc-0475-4a94-90ee-67d4ee21ccb1-S0
at slave(398)@10.3.1.5:60432 (build-srv-04.zq4gs31qjdiunm1ryi1452nvnh.dx.internal.cloudapp.net)
I0228 17:21:07.606578  7144 containerizer.cpp:2338] Destroying container a7769d0f-ccba-4b0a-8f25-bbb8f6f75331
in RUNNING state
I0228 17:21:07.607573  7144 containerizer.cpp:2952] Transitioning the state of container a7769d0f-ccba-4b0a-8f25-bbb8f6f75331
from RUNNING to DESTROYING
I0228 17:21:07.607573  7144 launcher.cpp:156] Asked to destroy container a7769d0f-ccba-4b0a-8f25-bbb8f6f75331
I0228 17:21:07.608572  9088 master.cpp:1306] Agent 7c635dbc-0475-4a94-90ee-67d4ee21ccb1-S0
at slave(398)@10.3.1.5:60432 (build-srv-04.zq4gs31qjdiunm1ryi1452nvnh.dx.internal.cloudapp.net)
disconnected
I0228 17:21:07.608572  9088 master.cpp:3276] Disconnecting agent 7c635dbc-0475-4a94-90ee-67d4ee21ccb1-S0
at slave(398)@10.3.1.5:60432 (build-srv-04.zq4gs31qjdiunm1ryi1452nvnh.dx.internal.cloudapp.net)
I0228 17:21:07.609575  1444 hierarchical.cpp:344] Removed framework 7c635dbc-0475-4a94-90ee-67d4ee21ccb1-0000
I0228 17:21:07.610571  9088 master.cpp:3295] Deactivating agent 7c635dbc-0475-4a94-90ee-67d4ee21ccb1-S0
at slave(398)@10.3.1.5:60432 (build-srv-04.zq4gs31qjdiunm1ryi1452nvnh.dx.internal.cloudapp.net)
I0228 17:21:07.610571  5156 hierarchical.cpp:766] Agent 7c635dbc-0475-4a94-90ee-67d4ee21ccb1-S0
deactivated
I0228 17:21:07.682708  1444 containerizer.cpp:2791] Container a7769d0f-ccba-4b0a-8f25-bbb8f6f75331
has exited
I0228 17:21:07.713708  9532 master.cpp:1149] Master terminating
I0228 17:21:07.716713  7452 hierarchical.cpp:609] Removed agent 7c635dbc-0475-4a94-90ee-67d4ee21ccb1-S0
I0228 17:21:08.437150  9756 process.cpp:929] Stopped the socket accept loop
```

- Mesos Reviewbot Windows


On Feb. 28, 2018, 4:13 p.m., Benjamin Bannier wrote:
> 
> -----------------------------------------------------------
> This is an automatically generated e-mail. To reply, visit:
> https://reviews.apache.org/r/65838/
> -----------------------------------------------------------
> 
> (Updated Feb. 28, 2018, 4:13 p.m.)
> 
> 
> Review request for mesos, Chun-Hung Hsiao, Jie Yu, and Jan Schlicht.
> 
> 
> Repository: mesos
> 
> 
> Description
> -------
> 
> Updated validation of 'RAW' and 'BLOCK' disk resources.
> 
> 
> Diffs
> -----
> 
>   src/common/resources.cpp a0c29246b3e3b377aabd0eb00ba16aa6bbd804e3 
> 
> 
> Diff: https://reviews.apache.org/r/65838/diff/1/
> 
> 
> Testing
> -------
> 
> `make check`
> `sudo make check`
> 
> 
> Thanks,
> 
> Benjamin Bannier
> 
>


Mime
  • Unnamed multipart/alternative (inline, None, 0 bytes)
View raw message