mesos-reviews mailing list archives

Site index · List index
Message view « Date » · « Thread »
Top « Date » · « Thread »
From Mesos Reviewbot Windows <revi...@mesos.apache.org>
Subject Re: Review Request 64461: Windows: Added legacy support for admin-only symlinks.
Date Mon, 11 Dec 2017 18:06:32 GMT

-----------------------------------------------------------
This is an automatically generated e-mail. To reply, visit:
https://reviews.apache.org/r/64461/#review193414
-----------------------------------------------------------



FAIL: Some Mesos tests failed.

Reviews applied: `['64461']`

Failed command: `D:\DCOS\mesos\src\mesos-tests.exe --verbose`

All the build artifacts available at: http://dcos-win.westus.cloudapp.azure.com/mesos-build/review/64461

Relevant logs:

- [mesos-tests-stdout.log](http://dcos-win.westus.cloudapp.azure.com/mesos-build/review/64461/logs/mesos-tests-stdout.log):

```

[----------] 1 test from IsolationFlag/CpuIsolatorTest
[ RUN      ] IsolationFlag/CpuIsolatorTest.ROOT_UserCpuUsage/0
[       OK ] IsolationFlag/CpuIsolatorTest.ROOT_UserCpuUsage/0 (2372 ms)
[----------] 1 test from IsolationFlag/CpuIsolatorTest (2394 ms total)

[----------] 1 test from IsolationFlag/MemoryIsolatorTest
[ RUN      ] IsolationFlag/MemoryIsolatorTest.ROOT_MemUsage/0
[       OK ] IsolationFlag/MemoryIsolatorTest.ROOT_MemUsage/0 (2469 ms)
[----------] 1 test from IsolationFlag/MemoryIsolatorTest (2494 ms total)

[----------] Global test environment tear-down
[==========] 825 tests from 84 test cases ran. (321166 ms total)
[  PASSED  ] 815 tests.
[  FAILED  ] 10 tests, listed below:
[  FAILED  ] OfferOperationStatusUpdateManagerTest.UpdateAndAckNonTerminalUpdate
[  FAILED  ] OfferOperationStatusUpdateManagerTest.RecoverCheckpointedStream
[  FAILED  ] OfferOperationStatusUpdateManagerTest.RecoverEmptyFile
[  FAILED  ] OfferOperationStatusUpdateManagerTest.RecoverTerminatedStream
[  FAILED  ] OfferOperationStatusUpdateManagerTest.IgnoreDuplicateUpdate
[  FAILED  ] OfferOperationStatusUpdateManagerTest.IgnoreDuplicateUpdateAfterRecover
[  FAILED  ] OfferOperationStatusUpdateManagerTest.RejectDuplicateAck
[  FAILED  ] OfferOperationStatusUpdateManagerTest.RejectDuplicateAckAfterRecover
[  FAILED  ] OfferOperationStatusUpdateManagerTest.NonStrictRecoveryCorruptedFile
[  FAILED  ] SlaveTest.ResourceProviderPublishAll

10 FAILED TESTS
  YOU HAVE 201 DISABLED TESTS

```

- [mesos-tests-stderr.log](http://dcos-win.westus.cloudapp.azure.com/mesos-build/review/64461/logs/mesos-tests-stderr.log):

```
I1211 18:06:13.566877  3136 exec.cpp:237] Executor registered on agent 2fa97121-5623-4dcb-90a3-eddfc7d105ab-S0
I1211 18:06:13.569878  8296 executor.cpp:171] Received SUBSCRIBED event
I1211 18:06:13.573878  8296 executor.cpp:175] Subscribed executor on build-srv-03.zq4gs31qjdiunm1ryi1452nvnh.dx.internal.cloudapp.net
I1211 18:06:13.573878  8296 executor.cpp:171] Received LAUNCH event
I1211 18:06:13.577877  8296 executor.cpp:637] Starting task f740d1f5-f30d-4b36-8195-59a73d07110d
I1211 18:06:13.656875  8296 executor.cpp:477] Running 'D:\DCOS\mesos\src\mesos-containerizer.exe
launch <POSSIBLY-SENSITIVE-DATA>'
I1211 18:06:14.214869  8296 executor.cpp:650] Forked command at 5336
I1211 18:06:14.247869  5840 exec.cpp:435] Executor asked to shutdown
I1211 18:06:14.248868  8296 executor.cpp:171] Received SHUTDOWN event
I1211 18:06:14.248868  8296 executor.cpp:747] Shutting down
I1211 18:06:14.248868  8296 executor.cpp:854] Sending SIGTERM to process tree at pid 5-0000
(latest state: TASK_KILLED, status update state: TASK_KILLED)
I1211 18:06:14.240901 10132 hierarchical.cpp:405] Deactivated framework 2fa97121-5623-4dcb-90a3-eddfc7d105ab-0000
I1211 18:06:14.243893  5968 slave.cpp:3400] Shutting down framework 2fa97121-5623-4dcb-90a3-eddfc7d105ab-0000
I1211 18:06:14.246897  5968 slave.cpp:6091] Shutting down executor 'f740d1f5-f30d-4b36-8195-59a73d07110d'
of framework 2fa97121-5623-4dcb-90a3-eddfc7d105ab-0000 at executor(1)@10.3.1.11:52191
I1211 18:06:14.247869  5968 slave.cpp:909] Agent terminating
W1211 18:06:14.247869  5968 slave.cpp:3396] Ignoring shutdown framework 2fa97121-5623-4dcb-90a3-eddfc7d105ab-0000
because it is terminating
I1211 18:06:14.248868  4728 master.cpp:10209] Removing task f740d1f5-f30d-4b36-8195-59a73d07110d
with resources cpus(allocated: *):4; mem(allocated: *):2048; disk(allocated: *):1024; ports(allocated:
*):[31000-32000] of framework 2fa97121-5623-4dcb-90a3-eddfc7d105ab-0000 on agent 2fa97121-5623-4dcb-90a3-eddfc7d105ab-S0
at slave(326)@10.3.1.11:52170 (build-srv-03.zq4gs31qjdiunm1ryi1452nvnh.dx.internal.cloudapp.net)
I1211 18:06:14.250895  8000 containerizer.cpp:2328] Destroying container 12a08478-55cf-4037-a87d-4ed9628738e5
in RUNNING state
I1211 18:06:14.250895  8000 containerizer.cpp:2930] Transitioning the state of container 12a08478-55cf-4037-a87d-4ed9628738e5
from RUNNING to DESTROYING
I1211 18:06:14.251873  4728 master.cpp:1310] Agent 2fa97121-5623-4dcb-90a3-eddfc7d105ab-S0
at slave(326)@10.3.1.11:52170 (build-srv-03.zq4gs31qjdiunm1ryi1452nvnh.dx.internal.cloudapp.net)
disconnected
I1211 18:06:14.251873  4728 master.cpp:3369] Disconnecting agent 2fa97121-5623-4dcb-90a3-eddfc7d105ab-S0
at slave(326)@10.3.1.11:52170 (build-srv-03.zq4gs31qjdiunm1ryi1452nvnh.dx.internal.cloudapp.net)
I1211 18:06:14.251873  4728 master.cpp:3388] Deactivating agent 2fa97121-5623-4dcb-90a3-eddfc7d105ab-S0
at slave(326)@10.3.1.11:52170 (build-srv-03.zq4gs31qjdiunm1ryi1452nvnh.dx.internal.cloudapp.net)
I1211 18:06:14.251873  5432 hierarchical.cpp:344] Removed framework 2fa97121-5623-4dcb-90a3-eddfc7d105ab-0000
I1211 18:06:14.251873  8000 launcher.cpp:156] Asked to destroy container 12a08478-55cf-4037-a87d-4ed9628738e5
I1211 18:06:14.252874  5432 hierarchical.cpp:762] Agent 2fa97121-5623-4dcb-90a3-eddfc7d105ab-S0
deactivated
I1211 18:06:14.345023  5648 containerizer.cpp:2779] Container 12a08478-55cf-4037-a87d-4ed9628738e5
has exited
I1211 18:06:14.373059  7996 master.cpp:1152] Master terminating
I1211 18:06:14.375032  3044 hierarchical.cpp:605] Removed agent 2fa97121-5623-4dcb-90a3-eddfc7d105ab-S0
I1211 18:06:14.722095  3636 process.cpp:887] Failed to accept socket: future discarded
```

- Mesos Reviewbot Windows


On Dec. 8, 2017, 9:18 p.m., Andrew Schwartzmeyer wrote:
> 
> -----------------------------------------------------------
> This is an automatically generated e-mail. To reply, visit:
> https://reviews.apache.org/r/64461/
> -----------------------------------------------------------
> 
> (Updated Dec. 8, 2017, 9:18 p.m.)
> 
> 
> Review request for mesos, Akash Gupta, Alexander Rukletsov, Greg Mann, and Joseph Wu.
> 
> 
> Bugs: MESOS-8307
>     https://issues.apache.org/jira/browse/MESOS-8307
> 
> 
> Repository: mesos
> 
> 
> Description
> -------
> 
> Some users are regrettably stuck on versions of Windows before this
> feature was added. If the `ALLOW_UNPRIVILEGED` flag is unsupported, the
> creation of the symlink will fail with `ERROR_INVALID_PARAMETER`. In
> this case, we try again without the flag (which will require
> administrative privileges, and so need to be guarded by a mutex) for
> these older systems.
> 
> 
> Diffs
> -----
> 
>   3rdparty/stout/include/stout/internal/windows/reparsepoint.hpp 158f44550327c63fb416052ad9978b55e4efe36b

> 
> 
> Diff: https://reviews.apache.org/r/64461/diff/1/
> 
> 
> Testing
> -------
> 
> Still works on Windows 10 Fall Creator's Update, needs to be tested to prove working
on legacy systems.
> 
> 
> Thanks,
> 
> Andrew Schwartzmeyer
> 
>


Mime
  • Unnamed multipart/alternative (inline, None, 0 bytes)
View raw message