mesos-reviews mailing list archives

Site index · List index
Message view « Date » · « Thread »
Top « Date » · « Thread »
From Mesos Reviewbot Windows <revi...@mesos.apache.org>
Subject Re: Review Request 64098: Send status updates when agent re-registers.
Date Fri, 01 Dec 2017 17:44:47 GMT

-----------------------------------------------------------
This is an automatically generated e-mail. To reply, visit:
https://reviews.apache.org/r/64098/#review192519
-----------------------------------------------------------



FAIL: Mesos libprocess-tests failed to build

Reviews applied: `['64250', '64098']`

Failed command: `cmake.exe --build . --target libprocess-tests --config Debug`

All the build artifacts available at: http://dcos-win.westus.cloudapp.azure.com/mesos-build/review/64098

Relevant logs:

- [libprocess-tests-build-cmake-stdout.log](http://dcos-win.westus.cloudapp.azure.com/mesos-build/review/64098/logs/libprocess-tests-build-cmake-stdout.log):

```
  C:\DCOS\mesos\mesos\3rdparty\stout\include\stout/windows/os.hpp(62): warning C4996: 'GetVersionExW':
was declared deprecated (compiling source file C:\DCOS\mesos\mesos\3rdparty\libprocess\src\tests\state_machine_tests.cpp)
[C:\DCOS\mesos\3rdparty\libprocess\src\tests\libprocess-tests.vcxproj]
  C:\DCOS\mesos\mesos\3rdparty\stout\include\stout/windows/os.hpp(451): warning C4996: 'GetVersionExW':
was declared deprecated (compiling source file C:\DCOS\mesos\mesos\3rdparty\libprocess\src\tests\state_machine_tests.cpp)
[C:\DCOS\mesos\3rdparty\libprocess\src\tests\libprocess-tests.vcxproj]
  C:\DCOS\mesos\mesos\3rdparty\stout\include\stout/windows/os.hpp(805): warning C4244: 'argument':
conversion from 'ULONG_PTR' to 'pid_t', possible loss of data (compiling source file C:\DCOS\mesos\mesos\3rdparty\libprocess\src\tests\state_machine_tests.cpp)
[C:\DCOS\mesos\3rdparty\libprocess\src\tests\libprocess-tests.vcxproj]
  C:\DCOS\mesos\mesos\3rdparty\stout\include\stout/windows/os.hpp(62): warning C4996: 'GetVersionExW':
was declared deprecated (compiling source file C:\DCOS\mesos\mesos\3rdparty\libprocess\src\tests\subprocess_tests.cpp)
[C:\DCOS\mesos\3rdparty\libprocess\src\tests\libprocess-tests.vcxproj]
  C:\DCOS\mesos\mesos\3rdparty\stout\include\stout/windows/os.hpp(451): warning C4996: 'GetVersionExW':
was declared deprecated (compiling source file C:\DCOS\mesos\mesos\3rdparty\libprocess\src\tests\subprocess_tests.cpp)
[C:\DCOS\mesos\3rdparty\libprocess\src\tests\libprocess-tests.vcxproj]
  C:\DCOS\mesos\mesos\3rdparty\stout\include\stout/windows/os.hpp(62): warning C4996: 'GetVersionExW':
was declared deprecated (compiling source file C:\DCOS\mesos\mesos\3rdparty\libprocess\src\tests\system_tests.cpp)
[C:\DCOS\mesos\3rdparty\libprocess\src\tests\libprocess-tests.vcxproj]
  C:\DCOS\mesos\mesos\3rdparty\stout\include\stout/windows/os.hpp(451): warning C4996: 'GetVersionExW':
was declared deprecated (compiling source file C:\DCOS\mesos\mesos\3rdparty\libprocess\src\tests\system_tests.cpp)
[C:\DCOS\mesos\3rdparty\libprocess\src\tests\libprocess-tests.vcxproj]
  C:\DCOS\mesos\mesos\3rdparty\stout\include\stout/windows/os.hpp(805): warning C4244: 'argument':
conversion from 'ULONG_PTR' to 'pid_t', possible loss of data (compiling source file C:\DCOS\mesos\mesos\3rdparty\libprocess\src\tests\system_tests.cpp)
[C:\DCOS\mesos\3rdparty\libprocess\src\tests\libprocess-tests.vcxproj]
  C:\DCOS\mesos\mesos\3rdparty\stout\include\stout/windows/os.hpp(805): warning C4244: 'argument':
conversion from 'ULONG_PTR' to 'pid_t', possible loss of data (compiling source file C:\DCOS\mesos\mesos\3rdparty\libprocess\src\tests\subprocess_tests.cpp)
[C:\DCOS\mesos\3rdparty\libprocess\src\tests\libprocess-tests.vcxproj]
  C:\DCOS\mesos\mesos\3rdparty\stout\include\stout/windows/os.hpp(62): warning C4996: 'GetVersionExW':
was declared deprecated (compiling source file C:\DCOS\mesos\mesos\3rdparty\libprocess\src\tests\time_tests.cpp)
[C:\DCOS\mesos\3rdparty\libprocess\src\tests\libprocess-tests.vcxproj]
  C:\DCOS\mesos\mesos\3rdparty\stout\include\stout/windows/os.hpp(451): warning C4996: 'GetVersionExW':
was declared deprecated (compiling source file C:\DCOS\mesos\mesos\3rdparty\libprocess\src\tests\time_tests.cpp)
[C:\DCOS\mesos\3rdparty\libprocess\src\tests\libprocess-tests.vcxproj]
  C:\DCOS\mesos\mesos\3rdparty\stout\include\stout/windows/os.hpp(805): warning C4244: 'argument':
conversion from 'ULONG_PTR' to 'pid_t', possible loss of data (compiling source file C:\DCOS\mesos\mesos\3rdparty\libprocess\src\tests\time_tests.cpp)
[C:\DCOS\mesos\3rdparty\libprocess\src\tests\libprocess-tests.vcxproj]
  C:\DCOS\mesos\mesos\3rdparty\stout\include\stout/windows/os.hpp(62): warning C4996: 'GetVersionExW':
was declared deprecated (compiling source file C:\DCOS\mesos\mesos\3rdparty\libprocess\src\tests\ssl_tests.cpp)
[C:\DCOS\mesos\3rdparty\libprocess\src\tests\libprocess-tests.vcxproj]
  C:\DCOS\mesos\mesos\3rdparty\stout\include\stout/windows/os.hpp(451): warning C4996: 'GetVersionExW':
was declared deprecated (compiling source file C:\DCOS\mesos\mesos\3rdparty\libprocess\src\tests\ssl_tests.cpp)
[C:\DCOS\mesos\3rdparty\libprocess\src\tests\libprocess-tests.vcxproj]


"C:\DCOS\mesos\3rdparty\libprocess\src\tests\libprocess-tests.vcxproj" (default target) (1)
->
(ClCompile target) -> 
  C:\DCOS\mesos\mesos\3rdparty\libprocess\include\process/ssl/gtest.hpp(355): error C2039:
'realpath': is not a member of 'os' (compiling source file C:\DCOS\mesos\mesos\3rdparty\libprocess\src\tests\http_tests.cpp)
[C:\DCOS\mesos\3rdparty\libprocess\src\tests\libprocess-tests.vcxproj]
  C:\DCOS\mesos\mesos\3rdparty\libprocess\include\process/ssl/gtest.hpp(355): error C3861:
'realpath': identifier not found (compiling source file C:\DCOS\mesos\mesos\3rdparty\libprocess\src\tests\http_tests.cpp)
[C:\DCOS\mesos\3rdparty\libprocess\src\tests\libprocess-tests.vcxproj]
  C:\DCOS\mesos\mesos\3rdparty\libprocess\include\process/ssl/gtest.hpp(355): error C2039:
'realpath': is not a member of 'os' (compiling source file C:\DCOS\mesos\mesos\3rdparty\libprocess\src\tests\socket_tests.cpp)
[C:\DCOS\mesos\3rdparty\libprocess\src\tests\libprocess-tests.vcxproj]
  C:\DCOS\mesos\mesos\3rdparty\libprocess\include\process/ssl/gtest.hpp(355): error C3861:
'realpath': identifier not found (compiling source file C:\DCOS\mesos\mesos\3rdparty\libprocess\src\tests\socket_tests.cpp)
[C:\DCOS\mesos\3rdparty\libprocess\src\tests\libprocess-tests.vcxproj]
  C:\DCOS\mesos\mesos\3rdparty\libprocess\include\process/ssl/gtest.hpp(355): error C2039:
'realpath': is not a member of 'os' (compiling source file C:\DCOS\mesos\mesos\3rdparty\libprocess\src\tests\ssl_tests.cpp)
[C:\DCOS\mesos\3rdparty\libprocess\src\tests\libprocess-tests.vcxproj]
  C:\DCOS\mesos\mesos\3rdparty\libprocess\include\process/ssl/gtest.hpp(355): error C3861:
'realpath': identifier not found (compiling source file C:\DCOS\mesos\mesos\3rdparty\libprocess\src\tests\ssl_tests.cpp)
[C:\DCOS\mesos\3rdparty\libprocess\src\tests\libprocess-tests.vcxproj]

    96 Warning(s)
    6 Error(s)

Time Elapsed 00:04:25.67
```

- [libprocess-tests-CMakeOutput.log](http://dcos-win.westus.cloudapp.azure.com/mesos-build/review/64098/logs/libprocess-tests-CMakeOutput.log):

```
  Creating directory "C:\DCOS\mesos\CMakeFiles\CMakeTmp\Debug\".

  Creating directory "cmTC_ec226.dir\Debug\cmTC_ec226.tlog\".

InitializeBuildStatus:

  Creating "cmTC_ec226.dir\Debug\cmTC_ec226.tlog\unsuccessfulbuild" because "AlwaysCreate"
was specified.

ClCompile:

  C:\Program Files (x86)\Microsoft Visual Studio\2017\Community\VC\Tools\MSVC\14.10.25017\bin\HostX64\x64\CL.exe
/c /Zi /W3 /WX- /diagnostics:classic /Od /Ob0 /D WIN32 /D _WINDOWS /D COMPILER_SUPPORTS_CXX11
/D "CMAKE_INTDIR=\"Debug\"" /D _MBCS /Gm- /EHsc /RTC1 /MDd /GS /fp:precise /Zc:wchar_t /Zc:forScope
/Zc:inline /GR /Fo"cmTC_ec226.dir\Debug\" /Fd"cmTC_ec226.dir\Debug\vc141.pdb" /Gd /TP /errorReport:queue
C:\DCOS\mesos\CMakeFiles\CMakeTmp\src.cxx

  Microsoft (R) C/C++ Optimizing Compiler Version 19.10.25019 for x64

  Copyright (C) Microsoft Corporation.  All rights reserved.

  

  cl /c /Zi /W3 /WX- /diagnostics:classic /Od /Ob0 /D WIN32 /D _WINDOWS /D COMPILER_SUPPORTS_CXX11
/D "CMAKE_INTDIR=\"Debug\"" /D _MBCS /Gm- /EHsc /RTC1 /MDd /GS /fp:precise /Zc:wchar_t /Zc:forScope
/Zc:inline /GR /Fo"cmTC_ec226.dir\Debug\" /Fd"cmTC_ec226.dir\Debug\vc141.pdb" /Gd /TP /errorReport:queue
C:\DCOS\mesos\CMakeFiles\CMakeTmp\src.cxx

  src.cxx

  

Link:

  C:\Program Files (x86)\Microsoft Visual Studio\2017\Community\VC\Tools\MSVC\14.10.25017\bin\HostX64\x64\link.exe
/ERRORREPORT:QUEUE /OUT:"C:\DCOS\mesos\CMakeFiles\CMakeTmp\Debug\cmTC_ec226.exe" /INCREMENTAL
/NOLOGO kernel32.lib user32.lib gdi32.lib winspool.lib shell32.lib ole32.lib oleaut32.lib
uuid.lib comdlg32.lib advapi32.lib /MANIFEST /MANIFESTUAC:"level='asInvoker' uiAccess='false'"
/manifest:embed /DEBUG /PDB:"C:/DCOS/mesos/CMakeFiles/CMakeTmp/Debug/cmTC_ec226.pdb" /SUBSYSTEM:CONSOLE
/TLBID:1 /DYNAMICBASE /NXCOMPAT /IMPLIB:"C:/DCOS/mesos/CMakeFiles/CMakeTmp/Debug/cmTC_ec226.lib"
/MACHINE:X64  /machine:x64 cmTC_ec226.dir\Debug\src.obj

  cmTC_ec226.vcxproj -> C:\DCOS\mesos\CMakeFiles\CMakeTmp\Debug\cmTC_ec226.exe

  cmTC_ec226.vcxproj -> C:/DCOS/mesos/CMakeFiles/CMakeTmp/Debug/cmTC_ec226.pdb (Full PDB)

FinalizeBuildStatus:

  Deleting file "cmTC_ec226.dir\Debug\cmTC_ec226.tlog\unsuccessfulbuild".

  Touching "cmTC_ec226.dir\Debug\cmTC_ec226.tlog\cmTC_ec226.lastbuildstate".

Done Building Project "C:\DCOS\mesos\CMakeFiles\CMakeTmp\cmTC_ec226.vcxproj" (default targets).



Build succeeded.

    0 Warning(s)

    0 Error(s)



Time Elapsed 00:00:01.83


Source file was:
int main() { return 0; }
```

- [libprocess-tests-CMakeError.log](http://dcos-win.westus.cloudapp.azure.com/mesos-build/review/64098/logs/libprocess-tests-CMakeError.log):

```
PrepareForBuild:

  Creating directory "cmTC_2f834.dir\Debug\".

  Creating directory "C:\DCOS\mesos\CMakeFiles\CMakeTmp\Debug\".

  Creating directory "cmTC_2f834.dir\Debug\cmTC_2f834.tlog\".

InitializeBuildStatus:

  Creating "cmTC_2f834.dir\Debug\cmTC_2f834.tlog\unsuccessfulbuild" because "AlwaysCreate"
was specified.

ClCompile:

  C:\Program Files (x86)\Microsoft Visual Studio\2017\Community\VC\Tools\MSVC\14.10.25017\bin\HostX64\x64\CL.exe
/c /Zi /W3 /WX- /diagnostics:classic /MP /Od /Ob0 /D WIN32 /D _WINDOWS /D UNICODE /D _UNICODE
/D "CMAKE_INTDIR=\"Debug\"" /D _UNICODE /D UNICODE /Gm- /RTC1 /MTd /GS /fp:precise /Zc:wchar_t
/Zc:forScope /Zc:inline /Fo"cmTC_2f834.dir\Debug\" /Fd"cmTC_2f834.dir\Debug\vc141.pdb" /Gd
/TC /errorReport:queue C:\DCOS\mesos\CMakeFiles\CMakeTmp\CheckIncludeFile.c

  Microsoft (R) C/C++ Optimizing Compiler Version 19.10.25019 for x64

  Copyright (C) Microsoft Corporation.  All rights reserved.

  

  cl /c /Zi /W3 /WX- /diagnostics:classic /MP /Od /Ob0 /D WIN32 /D _WINDOWS /D UNICODE /D
_UNICODE /D "CMAKE_INTDIR=\"Debug\"" /D _UNICODE /D UNICODE /Gm- /RTC1 /MTd /GS /fp:precise
/Zc:wchar_t /Zc:forScope /Zc:inline /Fo"cmTC_2f834.dir\Debug\" /Fd"cmTC_2f834.dir\Debug\vc141.pdb"
/Gd /TC /errorReport:queue C:\DCOS\mesos\CMakeFiles\CMakeTmp\CheckIncludeFile.c

  CheckIncludeFile.c

  

C:\DCOS\mesos\CMakeFiles\CMakeTmp\CheckIncludeFile.c(1): fatal error C1083: Cannot open include
file: 'pthread.h': No such file or directory [C:\DCOS\mesos\CMakeFiles\CMakeTmp\cmTC_2f834.vcxproj]

Done Building Project "C:\DCOS\mesos\CMakeFiles\CMakeTmp\cmTC_2f834.vcxproj" (default targets)
-- FAILED.



Build FAILED.



"C:\DCOS\mesos\CMakeFiles\CMakeTmp\cmTC_2f834.vcxproj" (default target) (1) ->

(ClCompile target) -> 

  C:\DCOS\mesos\CMakeFiles\CMakeTmp\CheckIncludeFile.c(1): fatal error C1083: Cannot open
include file: 'pthread.h': No such file or directory [C:\DCOS\mesos\CMakeFiles\CMakeTmp\cmTC_2f834.vcxproj]



    0 Warning(s)

    1 Error(s)



Time Elapsed 00:00:01.14



```

- Mesos Reviewbot Windows


On Nov. 28, 2017, 12:55 a.m., Megha Sharma wrote:
> 
> -----------------------------------------------------------
> This is an automatically generated e-mail. To reply, visit:
> https://reviews.apache.org/r/64098/
> -----------------------------------------------------------
> 
> (Updated Nov. 28, 2017, 12:55 a.m.)
> 
> 
> Review request for mesos, Ilya Pronin, James Peach, and Jiang Yan Xu.
> 
> 
> Bugs: MESOS-6406
>     https://issues.apache.org/jira/browse/MESOS-6406
> 
> 
> Repository: mesos
> 
> 
> Description
> -------
> 
> Master will send task status updates to frameworks when an agent
> which has been previously removed by the master for being unreachable
> re-registers.
> 
> 
> Diffs
> -----
> 
>   src/master/master.cpp dfe60ef670edcaefa0c1241df2e2870f650fcf9e 
>   src/tests/master_allocator_tests.cpp 3400d70bb0ba564eac43c4639eee0efd4d8059e6 
>   src/tests/master_tests.cpp 57eae320a7a398527cd3623c89bf67f319a8e955 
>   src/tests/partition_tests.cpp 31ebfe1655438eceae74d72a223df03a9dbd282d 
>   src/tests/persistent_volume_tests.cpp 4aa3c2e8b0f461cd78053707cff8bcb2e6f2b0d7 
>   src/tests/slave_recovery_tests.cpp f14c6ef69eb20a03454c8197df79b572a3c6d050 
>   src/tests/upgrade_tests.cpp 7f434dbba858f636719eec24e92b306b76430c4c 
> 
> 
> Diff: https://reviews.apache.org/r/64098/diff/5/
> 
> 
> Testing
> -------
> 
> with make check
> 
> 
> Thanks,
> 
> Megha Sharma
> 
>


Mime
  • Unnamed multipart/alternative (inline, None, 0 bytes)
View raw message