mesos-reviews mailing list archives

Site index · List index
Message view « Date » · « Thread »
Top « Date » · « Thread »
From Mesos Reviewbot Windows <revi...@mesos.apache.org>
Subject Re: Review Request 63496: Added tests for agent resource version transmission.
Date Thu, 02 Nov 2017 04:38:56 GMT

-----------------------------------------------------------
This is an automatically generated e-mail. To reply, visit:
https://reviews.apache.org/r/63496/#review189879
-----------------------------------------------------------



FAIL: Mesos tests failed to build.

Reviews applied: `['61183', '63491', '63492', '63493', '63494', '63495', '63496']`

Failed command: `cmake.exe --build . --target mesos-tests --config Debug`

All the build artifacts available at: http://dcos-win.westus.cloudapp.azure.com/mesos-build/review/63496

Relevant logs:

- [mesos-tests-build-cmake-stdout.log](http://dcos-win.westus.cloudapp.azure.com/mesos-build/review/63496/logs/mesos-tests-build-cmake-stdout.log):

```
  C:\DCOS\mesos\mesos\3rdparty\stout\include\stout/windows/os.hpp(59): warning C4996: 'GetVersionExW':
was declared deprecated (compiling source file C:\DCOS\mesos\mesos\src\tests\uri_fetcher_tests.cpp)
[C:\DCOS\mesos\src\tests\mesos-tests.vcxproj]
  C:\DCOS\mesos\mesos\3rdparty\stout\include\stout/windows/os.hpp(448): warning C4996: 'GetVersionExW':
was declared deprecated (compiling source file C:\DCOS\mesos\mesos\src\tests\uri_fetcher_tests.cpp)
[C:\DCOS\mesos\src\tests\mesos-tests.vcxproj]
  C:\DCOS\mesos\mesos\3rdparty\stout\include\stout/windows/os.hpp(59): warning C4996: 'GetVersionExW':
was declared deprecated (compiling source file C:\DCOS\mesos\mesos\src\tests\common\http_tests.cpp)
[C:\DCOS\mesos\src\tests\mesos-tests.vcxproj]
  C:\DCOS\mesos\mesos\3rdparty\stout\include\stout/windows/os.hpp(448): warning C4996: 'GetVersionExW':
was declared deprecated (compiling source file C:\DCOS\mesos\mesos\src\tests\common\http_tests.cpp)
[C:\DCOS\mesos\src\tests\mesos-tests.vcxproj]
  C:\DCOS\mesos\mesos\src\master/master.hpp(2072): warning C4244: 'return': conversion from
'unsigned __int64' to 'double', possible loss of data (compiling source file C:\DCOS\mesos\mesos\src\tests\values_tests.cpp)
[C:\DCOS\mesos\src\tests\mesos-tests.vcxproj]
  C:\DCOS\mesos\mesos\src\tests\values_tests.cpp(51): warning C4244: 'argument': conversion
from 'double' to 'float', possible loss of data [C:\DCOS\mesos\src\tests\mesos-tests.vcxproj]
  C:\DCOS\mesos\mesos\src\tests\values_tests.cpp(51): warning C4305: 'argument': truncation
from 'double' to 'float' [C:\DCOS\mesos\src\tests\mesos-tests.vcxproj]
  C:\DCOS\mesos\mesos\3rdparty\stout\include\stout/windows/os.hpp(59): warning C4996: 'GetVersionExW':
was declared deprecated (compiling source file C:\DCOS\mesos\mesos\src\tests\common\recordio_tests.cpp)
[C:\DCOS\mesos\src\tests\mesos-tests.vcxproj]
  C:\DCOS\mesos\mesos\3rdparty\stout\include\stout/windows/os.hpp(448): warning C4996: 'GetVersionExW':
was declared deprecated (compiling source file C:\DCOS\mesos\mesos\src\tests\common\recordio_tests.cpp)
[C:\DCOS\mesos\src\tests\mesos-tests.vcxproj]
  C:\DCOS\mesos\mesos\3rdparty\stout\include\stout/windows/os.hpp(59): warning C4996: 'GetVersionExW':
was declared deprecated (compiling source file C:\DCOS\mesos\mesos\src\tests\common\type_utils_tests.cpp)
[C:\DCOS\mesos\src\tests\mesos-tests.vcxproj]
  C:\DCOS\mesos\mesos\3rdparty\stout\include\stout/windows/os.hpp(448): warning C4996: 'GetVersionExW':
was declared deprecated (compiling source file C:\DCOS\mesos\mesos\src\tests\common\type_utils_tests.cpp)
[C:\DCOS\mesos\src\tests\mesos-tests.vcxproj]
  C:\DCOS\mesos\mesos\src\master/master.hpp(2072): warning C4244: 'return': conversion from
'unsigned __int64' to 'double', possible loss of data (compiling source file C:\DCOS\mesos\mesos\src\tests\common\type_utils_tests.cpp)
[C:\DCOS\mesos\src\tests\mesos-tests.vcxproj]
  C:\DCOS\mesos\mesos\3rdparty\stout\include\stout/windows/os.hpp(59): warning C4996: 'GetVersionExW':
was declared deprecated (compiling source file C:\DCOS\mesos\mesos\src\tests\containerizer\containerizer_tests.cpp)
[C:\DCOS\mesos\src\tests\mesos-tests.vcxproj]
  C:\DCOS\mesos\mesos\3rdparty\stout\include\stout/windows/os.hpp(448): warning C4996: 'GetVersionExW':
was declared deprecated (compiling source file C:\DCOS\mesos\mesos\src\tests\containerizer\containerizer_tests.cpp)
[C:\DCOS\mesos\src\tests\mesos-tests.vcxproj]
  C:\DCOS\mesos\mesos\3rdparty\stout\include\stout/windows/os.hpp(59): warning C4996: 'GetVersionExW':
was declared deprecated (compiling source file C:\DCOS\mesos\mesos\src\tests\containerizer\docker_tests.cpp)
[C:\DCOS\mesos\src\tests\mesos-tests.vcxproj]
  C:\DCOS\mesos\mesos\3rdparty\stout\include\stout/windows/os.hpp(448): warning C4996: 'GetVersionExW':
was declared deprecated (compiling source file C:\DCOS\mesos\mesos\src\tests\containerizer\docker_tests.cpp)
[C:\DCOS\mesos\src\tests\mesos-tests.vcxproj]
  C:\DCOS\mesos\mesos\src\master/master.hpp(2072): warning C4244: 'return': conversion from
'unsigned __int64' to 'double', possible loss of data (compiling source file C:\DCOS\mesos\mesos\src\tests\containerizer\containerizer_tests.cpp)
[C:\DCOS\mesos\src\tests\mesos-tests.vcxproj]
  C:\DCOS\mesos\mesos\src\master/master.hpp(2072): warning C4244: 'return': conversion from
'unsigned __int64' to 'double', possible loss of data (compiling source file C:\DCOS\mesos\mesos\src\tests\containerizer\docker_tests.cpp)
[C:\DCOS\mesos\src\tests\mesos-tests.vcxproj]


"C:\DCOS\mesos\src\tests\mesos-tests.vcxproj" (default target) (1) ->
(Link target) -> 
  default_executor_tests.obj : error LNK2001: unresolved external symbol "public: static char
const * const mesos::internal::tests::KillPolicyTestHelper::NAME" (?NAME@KillPolicyTestHelper@tests@internal@mesos@@2QBDB)
[C:\DCOS\mesos\src\tests\mesos-tests.vcxproj]
  C:\DCOS\mesos\src\mesos-tests.exe : fatal error LNK1120: 1 unresolved externals [C:\DCOS\mesos\src\tests\mesos-tests.vcxproj]

    454 Warning(s)
    2 Error(s)

Time Elapsed 01:09:43.31
```

- [mesos-tests-CMakeOutput.log](http://dcos-win.westus.cloudapp.azure.com/mesos-build/review/63496/logs/mesos-tests-CMakeOutput.log):

```
  Creating directory "C:\DCOS\mesos\CMakeFiles\CMakeTmp\Debug\".

  Creating directory "cmTC_8ad2c.dir\Debug\cmTC_8ad2c.tlog\".

InitializeBuildStatus:

  Creating "cmTC_8ad2c.dir\Debug\cmTC_8ad2c.tlog\unsuccessfulbuild" because "AlwaysCreate"
was specified.

ClCompile:

  C:\Program Files (x86)\Microsoft Visual Studio\2017\Community\VC\Tools\MSVC\14.10.25017\bin\HostX64\x64\CL.exe
/c /Zi /W3 /WX- /diagnostics:classic /Od /Ob0 /D WIN32 /D _WINDOWS /D COMPILER_SUPPORTS_CXX11
/D "CMAKE_INTDIR=\"Debug\"" /D _MBCS /Gm- /EHsc /RTC1 /MDd /GS /fp:precise /Zc:wchar_t /Zc:forScope
/Zc:inline /GR /Fo"cmTC_8ad2c.dir\Debug\" /Fd"cmTC_8ad2c.dir\Debug\vc141.pdb" /Gd /TP /errorReport:queue
C:\DCOS\mesos\CMakeFiles\CMakeTmp\src.cxx

  Microsoft (R) C/C++ Optimizing Compiler Version 19.10.25019 for x64

  Copyright (C) Microsoft Corporation.  All rights reserved.

  

  cl /c /Zi /W3 /WX- /diagnostics:classic /Od /Ob0 /D WIN32 /D _WINDOWS /D COMPILER_SUPPORTS_CXX11
/D "CMAKE_INTDIR=\"Debug\"" /D _MBCS /Gm- /EHsc /RTC1 /MDd /GS /fp:precise /Zc:wchar_t /Zc:forScope
/Zc:inline /GR /Fo"cmTC_8ad2c.dir\Debug\" /Fd"cmTC_8ad2c.dir\Debug\vc141.pdb" /Gd /TP /errorReport:queue
C:\DCOS\mesos\CMakeFiles\CMakeTmp\src.cxx

  src.cxx

  

Link:

  C:\Program Files (x86)\Microsoft Visual Studio\2017\Community\VC\Tools\MSVC\14.10.25017\bin\HostX64\x64\link.exe
/ERRORREPORT:QUEUE /OUT:"C:\DCOS\mesos\CMakeFiles\CMakeTmp\Debug\cmTC_8ad2c.exe" /INCREMENTAL
/NOLOGO kernel32.lib user32.lib gdi32.lib winspool.lib shell32.lib ole32.lib oleaut32.lib
uuid.lib comdlg32.lib advapi32.lib /MANIFEST /MANIFESTUAC:"level='asInvoker' uiAccess='false'"
/manifest:embed /DEBUG /PDB:"C:/DCOS/mesos/CMakeFiles/CMakeTmp/Debug/cmTC_8ad2c.pdb" /SUBSYSTEM:CONSOLE
/TLBID:1 /DYNAMICBASE /NXCOMPAT /IMPLIB:"C:/DCOS/mesos/CMakeFiles/CMakeTmp/Debug/cmTC_8ad2c.lib"
/MACHINE:X64  /machine:x64 cmTC_8ad2c.dir\Debug\src.obj

  cmTC_8ad2c.vcxproj -> C:\DCOS\mesos\CMakeFiles\CMakeTmp\Debug\cmTC_8ad2c.exe

  cmTC_8ad2c.vcxproj -> C:/DCOS/mesos/CMakeFiles/CMakeTmp/Debug/cmTC_8ad2c.pdb (Full PDB)

FinalizeBuildStatus:

  Deleting file "cmTC_8ad2c.dir\Debug\cmTC_8ad2c.tlog\unsuccessfulbuild".

  Touching "cmTC_8ad2c.dir\Debug\cmTC_8ad2c.tlog\cmTC_8ad2c.lastbuildstate".

Done Building Project "C:\DCOS\mesos\CMakeFiles\CMakeTmp\cmTC_8ad2c.vcxproj" (default targets).



Build succeeded.

    0 Warning(s)

    0 Error(s)



Time Elapsed 00:00:01.77


Source file was:
int main() { return 0; }
```

- [mesos-tests-CMakeError.log](http://dcos-win.westus.cloudapp.azure.com/mesos-build/review/63496/logs/mesos-tests-CMakeError.log):

```
PrepareForBuild:

  Creating directory "cmTC_9c79f.dir\Debug\".

  Creating directory "C:\DCOS\mesos\CMakeFiles\CMakeTmp\Debug\".

  Creating directory "cmTC_9c79f.dir\Debug\cmTC_9c79f.tlog\".

InitializeBuildStatus:

  Creating "cmTC_9c79f.dir\Debug\cmTC_9c79f.tlog\unsuccessfulbuild" because "AlwaysCreate"
was specified.

ClCompile:

  C:\Program Files (x86)\Microsoft Visual Studio\2017\Community\VC\Tools\MSVC\14.10.25017\bin\HostX64\x64\CL.exe
/c /Zi /W3 /WX- /diagnostics:classic /MP /Od /Ob0 /D WIN32 /D _WINDOWS /D UNICODE /D _UNICODE
/D "CMAKE_INTDIR=\"Debug\"" /D _UNICODE /D UNICODE /Gm- /RTC1 /MTd /GS /fp:precise /Zc:wchar_t
/Zc:forScope /Zc:inline /Fo"cmTC_9c79f.dir\Debug\" /Fd"cmTC_9c79f.dir\Debug\vc141.pdb" /Gd
/TC /errorReport:queue C:\DCOS\mesos\CMakeFiles\CMakeTmp\CheckIncludeFile.c

  Microsoft (R) C/C++ Optimizing Compiler Version 19.10.25019 for x64

  Copyright (C) Microsoft Corporation.  All rights reserved.

  

  cl /c /Zi /W3 /WX- /diagnostics:classic /MP /Od /Ob0 /D WIN32 /D _WINDOWS /D UNICODE /D
_UNICODE /D "CMAKE_INTDIR=\"Debug\"" /D _UNICODE /D UNICODE /Gm- /RTC1 /MTd /GS /fp:precise
/Zc:wchar_t /Zc:forScope /Zc:inline /Fo"cmTC_9c79f.dir\Debug\" /Fd"cmTC_9c79f.dir\Debug\vc141.pdb"
/Gd /TC /errorReport:queue C:\DCOS\mesos\CMakeFiles\CMakeTmp\CheckIncludeFile.c

  CheckIncludeFile.c

  

C:\DCOS\mesos\CMakeFiles\CMakeTmp\CheckIncludeFile.c(1): fatal error C1083: Cannot open include
file: 'pthread.h': No such file or directory [C:\DCOS\mesos\CMakeFiles\CMakeTmp\cmTC_9c79f.vcxproj]

Done Building Project "C:\DCOS\mesos\CMakeFiles\CMakeTmp\cmTC_9c79f.vcxproj" (default targets)
-- FAILED.



Build FAILED.



"C:\DCOS\mesos\CMakeFiles\CMakeTmp\cmTC_9c79f.vcxproj" (default target) (1) ->

(ClCompile target) -> 

  C:\DCOS\mesos\CMakeFiles\CMakeTmp\CheckIncludeFile.c(1): fatal error C1083: Cannot open
include file: 'pthread.h': No such file or directory [C:\DCOS\mesos\CMakeFiles\CMakeTmp\cmTC_9c79f.vcxproj]



    0 Warning(s)

    1 Error(s)



Time Elapsed 00:00:01.13



```

- Mesos Reviewbot Windows


On Nov. 1, 2017, 6:57 p.m., Benjamin Bannier wrote:
> 
> -----------------------------------------------------------
> This is an automatically generated e-mail. To reply, visit:
> https://reviews.apache.org/r/63496/
> -----------------------------------------------------------
> 
> (Updated Nov. 1, 2017, 6:57 p.m.)
> 
> 
> Review request for mesos, Jie Yu and Jan Schlicht.
> 
> 
> Repository: mesos
> 
> 
> Description
> -------
> 
> This patch introduces separate tests for clock values communicated
> from resource providers and from agents to masters.
> 
> 
> Diffs
> -----
> 
>   src/tests/slave_tests.cpp aae5e6021b46793fa2b871aaa738f61c8cfb88ce 
> 
> 
> Diff: https://reviews.apache.org/r/63496/diff/1/
> 
> 
> Testing
> -------
> 
> `make check`
> 
> 
> Thanks,
> 
> Benjamin Bannier
> 
>


Mime
  • Unnamed multipart/alternative (inline, None, 0 bytes)
View raw message