mesos-reviews mailing list archives

Site index · List index
Message view « Date » · « Thread »
Top « Date » · « Thread »
From Mesos Reviewbot Windows <revi...@mesos.apache.org>
Subject Re: Review Request 62381: Removed `docker exec` when performing health checks in docker executor.
Date Mon, 18 Sep 2017 20:15:56 GMT

-----------------------------------------------------------
This is an automatically generated e-mail. To reply, visit:
https://reviews.apache.org/r/62381/#review185622
-----------------------------------------------------------



FAIL: Some Mesos tests failed.

Reviews applied: `['62381']`

Failed command: `C:\mesos\src\mesos-tests.exe --verbose`

All the build artifacts available at: http://dcos-win.westus.cloudapp.azure.com/mesos-build/review/62381

Relevant logs:

- [mesos-tests-stdout.log](http://dcos-win.westus.cloudapp.azure.com/mesos-build/review/62381/logs/mesos-tests-stdout.log):

```
[ RUN      ] ContentType/SchedulerTest.SchedulerReconnect/0
[       OK ] ContentType/SchedulerTest.SchedulerReconnect/0 (239 ms)
[ RUN      ] ContentType/SchedulerTest.SchedulerReconnect/1
[       OK ] ContentType/SchedulerTest.SchedulerReconnect/1 (257 ms)
[----------] 30 tests from ContentType/SchedulerTest (25468 ms total)

[----------] 2 tests from ContentTypeAndSSLConfig/SchedulerSSLTest
[ RUN      ] ContentTypeAndSSLConfig/SchedulerSSLTest.RunTaskAndTeardown/0
[       OK ] ContentTypeAndSSLConfig/SchedulerSSLTest.RunTaskAndTeardown/0 (952 ms)
[ RUN      ] ContentTypeAndSSLConfig/SchedulerSSLTest.RunTaskAndTeardown/1
[       OK ] ContentTypeAndSSLConfig/SchedulerSSLTest.RunTaskAndTeardown/1 (1018 ms)
[----------] 2 tests from ContentTypeAndSSLConfig/SchedulerSSLTest (2049 ms total)

[----------] 2 tests from ContainerizerType/DefaultContainerDNSFlagTest
[ RUN      ] ContainerizerType/DefaultContainerDNSFlagTest.ValidateFlag/0
[       OK ] ContainerizerType/DefaultContainerDNSFlagTest.ValidateFlag/0 (144 ms)
[ RUN      ] ContainerizerType/DefaultContainerDNSFlagTest.ValidateFlag/1
[       OK ] ContainerizerType/DefaultContainerDNSFlagTest.ValidateFlag/1 (154 ms)
[----------] 2 tests from ContainerizerType/DefaultContainerDNSFlagTest (333 ms total)

[----------] Global test environment tear-down
[==========] 627 tests from 66 test cases ran. (346444 ms total)
[  PASSED  ] 626 tests.
[  FAILED  ] 1 test, listed below:
[  FAILED  ] ContentType/MasterAPITest.EventAuthorizationFiltering/1, where GetParam() = application/json

 1 FAILED TEST
  YOU HAVE 174 DISABLED TESTS

```

- [mesos-tests-stderr.log](http://dcos-win.westus.cloudapp.azure.com/mesos-build/review/62381/logs/mesos-tests-stderr.log):

```
I0918 20:15:15.129381 20048 master.cpp:8418] Removing framework 1d91d741-8216-4725-96b3-9211950d051a-0000
(default)
I0918 20:15:15.130378 20048 master.cpp:3267] Deactivating framework 1d91d741-8216-4725-96b3-9211950d051a-0000
(default)
I0918 20:15:15.130378 19020 hierarchical.cpp:412] Deactivated framework 1d91d741-8216-4725-96b3-9211950d051a-0000
I0918 20:15:15.130378 17216 slave.cpp:3235] Shutting down framework 1d91d741-8216-4725-96b3-9211950d051a-0000
I0918 20:15:15.130378 20048 master.cpp:8993] Updating the state of task e2e6acbd-c12d-4aaf-b75a-ab9fcb6cb2d0
of framework 1d91d741-8216-4725-96b3-9211950d051a-0000 (latest state: TASK_KILLED, status
update state: TASK_KILLED)
I0918 20:15:15.131378 17216 slave.cpp:5731] Shutting down executor 'default' of framework
1d91d741-8216-4725-96b3-9211950d051a-0000 (via HTTP)
I0918 20:15:15.139425 20048 master.cpp:9087] Removing task e2e6acbd-c12d-4aaf-b75a-ab9fcb6cb2d0
with resources [{"allocation_info":{"role":"*"},"name":"cpus","scalar":{"value":2.0},"type":"SCALAR"},{"allocation_info":{"role":"*"},"name":"mem","scalar":{"value":1024.0},"type":"SCALAR"},{"allocation_info":{"role":"*"},"name":"disk","scalar":{"value":1024.0},"type":"SCALAR"},{"allocation_info":{"role":"*"},"name":"ports","ranges":{"range":[{"begin":31000,"end":32000}]},"type":"RANGES"}]
of framework 1d91d741-8216-4725-96b3-9211950d051a-0000 on agent 1d91d741-8216-4725-96b3-9211950d051a-S0
at slave(254)@10.3.1.5:51096 (mesos-bld-s1.zq4gs31qjdiunm1ryi1452nvnh.dx.internal.cloudapp.net)
I0918 20:15:15.158382 20048 master.cpp:9116] Removing executor 'default' with resources []
of framework 1d91d741-8216-4725-96b3-9211950d051a-0000 on agent 1d91d741-8216-4725-96b3-9211950d051a-S0
at slave(254)@10.3.1.5:51096 (mesos-bld-s1.zq4gs31qjdiunm1ryi1452nvnh.dx.internal.cloudapp.net)
I0918 20:15:15.161382 19988 hierarchical.cpp:355] Removed framework 1d91d741-8216-4725-96b3-9211950d051a-0000
E0918 20:15:15.162381 19692 scheduler.cpp:649] End-Of-File received from master. The master
closed the event stream
I0918 20:15:15.172384 19692 scheduler.cpp:444] Re-detecting master
I0918 20:15:15.174382 19020 scheduler.cpp:470] New master detected at master@10.3.1.5:51096
I0918 20:15:15.188383 19988 slave.cpp:5407] Executor 'default' of framework 1d91d741-8216-4725-96b3-9211950d051a-0000
exited with status 0
I0918 20:15:15.188383 19988 slave.cpp:5511] Cleaning up executor 'default' of framework 1d91d741-8216-4725-96b3-9211950d051a-0000
(via HTTP)
W0918 20:15:15.188383 19692 master.cpp:7021] Ignoring unknown exited executor 'default' of
framework 1d91d741-8216-4725-96b3-9211950d051a-0000 on agent 1d91d741-8216-4725-96b3-9211950d051a-S0
at slave(254)@10.3.1.5:51096 (mesos-bld-s1.zq4gs31qjdiunm1ryi1452nvnh.dx.internal.cloudapp.net)
I0918 20:15:15.188383 19908 gc.cpp:91] Scheduling 'C:\Users\mesos\AppData\Local\Temp\2\TomYjK\slaves\1d91d741-8216-4725-96b3-9211950d051a-S0\frameworks\1d91d741-8216-4725-96b3-9211950d051a-0000\executors\default\runs\5ca05c5f-a8d4-4a2a-a42e-5ebb5853191a'
for gc 6.99998624555556days in the future
I0918 20:15:15.188383 19988 slave.cpp:5607] Cleaning up framework 1d91d741-8216-4725-96b3-9211950d051a-0000
I0918 20:15:15.236774 19692 status_update_manager.cpp:285] Closing status update streams for
framework 1d91d741-8216-4725-96b3-9211950d051a-0000
I0918 20:15:15.236774 19908 gc.cpp:91] Scheduling 'C:\Users\mesos\AppData\Local\Temp\2\TomYjK\slaves\1d91d741-8216-4725-96b3-9211950d051a-S0\frameworks\1d91d741-8216-4725-96b3-9211950d051a-0000\executors\default'
for gc 6.99998624555556days in the future
I0918 20:15:15.237795 19908 gc.cpp:91] Scheduling 'C:\Users\mesos\AppData\Local\Temp\2\TomYjK\slaves\1d91d741-8216-4725-96b3-9211950d051a-S0\frameworks\1d91d741-8216-4725-96b3-9211950d051a-0000'
for gc 6.99998568547556days in the future
I0918 20:15:15.237795 19988 slave.cpp:861] Agent terminating
I0918 20:15:15.238782 19020 master.cpp:1321] Agent 1d91d741-8216-4725-96b3-9211950d051a-S0
at slave(254)@10.3.1.5:51096 (mesos-bld-s1.zq4gs31qjdiunm1ryi1452nvnh.dx.internal.cloudapp.net)
disconnected
I0918 20:15:15.249435 19020 master.cpp:3304] Disconnecting agent 1d91d741-8216-4725-96b3-9211950d051a-S0
at slave(254)@10.3.1.5:51096 (mesos-bld-s1.zq4gs31qjdiunm1ryi1452nvnh.dx.internal.cloudapp.net)
I0918 20:15:15.249781 19020 master.cpp:3323] Deactivating agent 1d91d741-8216-4725-96b3-9211950d051a-S0
at slave(254)@10.3.1.5:51096 (mesos-bld-s1.zq4gs31qjdiunm1ryi1452nvnh.dx.internal.cloudapp.net)
I0918 20:15:15.249781 19692 hierarchical.cpp:690] Agent 1d91d741-8216-4725-96b3-9211950d051a-S0
deactivated
I0918 20:15:15.271785 19392 master.cpp:1163] Master terminating
I0918 20:15:15.275784 19988 hierarchical.cpp:626] Removed agent 1d91d741-8216-4725-96b3-9211950d051a-S0
W0918 20:15:15.284785 19392 master.hpp:2761] Failed to close HTTP pipe for 1d91d741-8216-4725-96b3-9211950d051a-0000
(default)
I0918 20:15:15.960824 19968 process.cpp:1068] Failed to accept socket: future discarded
```

- Mesos Reviewbot Windows


On Sept. 18, 2017, 5:21 p.m., Andrei Budnik wrote:
> 
> -----------------------------------------------------------
> This is an automatically generated e-mail. To reply, visit:
> https://reviews.apache.org/r/62381/
> -----------------------------------------------------------
> 
> (Updated Sept. 18, 2017, 5:21 p.m.)
> 
> 
> Review request for mesos, Alexander Rukletsov, Gastón Kleiman, haosdent huang, and Lukas
Loesche.
> 
> 
> Bugs: MESOS-4812
>     https://issues.apache.org/jira/browse/MESOS-4812
> 
> 
> Repository: mesos
> 
> 
> Description
> -------
> 
> Mesos can enter namespaces via `setns` for launched subprocesses, hence
> we got rid of `docker exec` for command health checks. This change
> leads to more stable command health checks by making them independent
> from docker daemon that might hang. Also, this commit fixes the issue
> with incorrect escaping of quote characters in command health checks.
> 
> 
> Diffs
> -----
> 
>   src/docker/executor.cpp e9949f652cd8527991ebfdfbf14e68b4c958fe79 
>   src/tests/health_check_tests.cpp f4b50b1cb505084f64bf2dd279d9189ca65c8cdc 
> 
> 
> Diff: https://reviews.apache.org/r/62381/diff/2/
> 
> 
> Testing
> -------
> 
> internal CI
> 
> 
> Thanks,
> 
> Andrei Budnik
> 
>


Mime
  • Unnamed multipart/alternative (inline, None, 0 bytes)
View raw message