mesos-issues mailing list archives

Site index · List index
Message view « Date » · « Thread »
Top « Date » · « Thread »
From "haosdent (JIRA)" <j...@apache.org>
Subject [jira] [Comment Edited] (MESOS-3974) CgroupsAnyHierarchyMemoryPressureTest tests fail on CentOS 6.7.
Date Tue, 24 Nov 2015 02:14:10 GMT

    [ https://issues.apache.org/jira/browse/MESOS-3974?page=com.atlassian.jira.plugin.system.issuetabpanels:comment-tabpanel&focusedCommentId=15023599#comment-15023599
] 

haosdent edited comment on MESOS-3974 at 11/24/15 2:13 AM:
-----------------------------------------------------------

CentOS 6.7 use 2.6.32, don't have memory.pressure_level in /cgroup
(_low).failure(): Failed to register notification eventfd: Failed to open '/cgroup/memory/mesos_test/memory.pressure_level':
No such file or 
directory
I think this problem always exists in before vesions. https://issues.apache.org/jira/browse/MESOS-3473
and https://reviews.apache.org/r/38532/


was (Author: haosdent@gmail.com):
CentOS 6.7 use 2.6.32, don't have memory.pressure_level in /cgroup
(_low).failure(): Failed to register notification eventfd: Failed to open '/cgroup/memory/mesos_test/memory.pressure_level':
No such file or 
directory
I think this problem always exists in before vesions. https://reviews.apache.org/r/38532/

> CgroupsAnyHierarchyMemoryPressureTest tests fail on CentOS 6.7.
> ---------------------------------------------------------------
>
>                 Key: MESOS-3974
>                 URL: https://issues.apache.org/jira/browse/MESOS-3974
>             Project: Mesos
>          Issue Type: Bug
>    Affects Versions: 0.26.0
>         Environment: CentOS 6.7, kernel 2.6.32-573.el6.x86_64, gcc 4.8.2, docker 1.7.1
>            Reporter: Till Toenshoff
>            Assignee: Benjamin Bannier
>              Labels: mesosphere
>
> {noformat}
> GLOG_v=2 sudo ./bin/mesos-tests.sh --gtest_filter="CgroupsAnyHierarchyMemoryPressureTest.*"
--verbose
> {noformat}
> {noformat}
> WARNING: Logging before InitGoogleLogging() is written to STDERR
> I1120 17:40:40.410383  2467 process.cpp:2426] Spawned process __gc__@127.0.0.1:45300
> I1120 17:40:40.410909  2467 process.cpp:2426] Spawned process help@127.0.0.1:45300
> I1120 17:40:40.410845  2483 process.cpp:2436] Resuming __gc__@127.0.0.1:45300 at 2015-11-20
17:40:40.410562048+00:00
> I1120 17:40:40.410970  2467 process.cpp:2426] Spawned process logging@127.0.0.1:45300
> I1120 17:40:40.410995  2467 process.cpp:2426] Spawned process profiler@127.0.0.1:45300
> I1120 17:40:40.411015  2482 process.cpp:2436] Resuming help@127.0.0.1:45300 at 2015-11-20
17:40:40.410989056+00:00
> I1120 17:40:40.411063  2467 process.cpp:2426] Spawned process system@127.0.0.1:45300
> I1120 17:40:40.411160  2482 process.cpp:2436] Resuming profiler@127.0.0.1:45300 at 2015-11-20
17:40:40.411155968+00:00
> I1120 17:40:40.411206  2467 process.cpp:2426] Spawned process __limiter__(1)@127.0.0.1:45300
> I1120 17:40:40.411223  2467 process.cpp:2426] Spawned process metrics@127.0.0.1:45300
> I1120 17:40:40.411268  2482 process.cpp:2436] Resuming system@127.0.0.1:45300 at 2015-11-20
17:40:40.411266048+00:00
> I1120 17:40:40.411378  2483 process.cpp:2436] Resuming __limiter__(1)@127.0.0.1:45300
at 2015-11-20 17:40:40.411374080+00:00
> I1120 17:40:40.411388  2467 process.cpp:2426] Spawned process __processes__@127.0.0.1:45300
> I1120 17:40:40.411399  2483 process.cpp:2436] Resuming __processes__@127.0.0.1:45300
at 2015-11-20 17:40:40.411397888+00:00
> I1120 17:40:40.411402  2467 process.cpp:965] libprocess is initialized on 127.0.0.1:45300
for 8 cpus
> I1120 17:40:40.411415  2488 process.cpp:2436] Resuming help@127.0.0.1:45300 at 2015-11-20
17:40:40.411397888+00:00
> I1120 17:40:40.411432  2467 logging.cpp:177] Logging to STDERR
> I1120 17:40:40.411384  2482 process.cpp:2436] Resuming metrics@127.0.0.1:45300 at 2015-11-20
17:40:40.411379200+00:00
> I1120 17:40:40.411717  2482 process.cpp:2436] Resuming help@127.0.0.1:45300 at 2015-11-20
17:40:40.411710976+00:00
> I1120 17:40:40.411813  2487 process.cpp:2436] Resuming logging@127.0.0.1:45300 at 2015-11-20
17:40:40.411789056+00:00
> I1120 17:40:40.411989  2487 process.cpp:2436] Resuming help@127.0.0.1:45300 at 2015-11-20
17:40:40.411983872+00:00
> Source directory: /home/vagrant/mesos
> Build directory: /home/vagrant/mesos/build
> -------------------------------------------------------------
> We cannot run any cgroups tests that require mounting
> hierarchies because you have the following hierarchies mounted:
> /cgroup/blkio, /cgroup/cpu, /cgroup/cpuacct, /cgroup/cpuset, /cgroup/devices, /cgroup/freezer,
/cgroup/memory, /cgroup/net_cls
> We'll disable the CgroupsNoHierarchyTest test fixture for now.
> -------------------------------------------------------------
> I1120 17:40:40.414676  2467 process.cpp:2426] Spawned process reaper(1)@127.0.0.1:45300
> I1120 17:40:40.414728  2482 process.cpp:2436] Resuming reaper(1)@127.0.0.1:45300 at 2015-11-20
17:40:40.414701824+00:00
> I1120 17:40:40.415870  2467 process.cpp:2426] Spawned process __latch__(1)@127.0.0.1:45300
> I1120 17:40:40.415913  2483 process.cpp:2436] Resuming __gc__@127.0.0.1:45300 at 2015-11-20
17:40:40.415889920+00:00
> I1120 17:40:40.415966  2467 process.cpp:2426] Spawned process __waiter__(1)@127.0.0.1:45300
> I1120 17:40:40.416054  2483 process.cpp:2436] Resuming __latch__(1)@127.0.0.1:45300 at
2015-11-20 17:40:40.416045056+00:00
> I1120 17:40:40.416070  2467 process.cpp:2734] Donating thread to __waiter__(1)@127.0.0.1:45300
while waiting
> I1120 17:40:40.416093  2467 process.cpp:2436] Resuming __waiter__(1)@127.0.0.1:45300
at 2015-11-20 17:40:40.416083968+00:00
> I1120 17:40:40.517282  2483 process.cpp:2436] Resuming reaper(1)@127.0.0.1:45300 at 2015-11-20
17:40:40.517263872+00:00
> I1120 17:40:40.519779  2488 process.cpp:2436] Resuming __latch__(1)@127.0.0.1:45300 at
2015-11-20 17:40:40.519730176+00:00
> I1120 17:40:40.519865  2488 process.cpp:2541] Cleaning up __latch__(1)@127.0.0.1:45300
> I1120 17:40:40.520251  2488 process.cpp:2436] Resuming __waiter__(1)@127.0.0.1:45300
at 2015-11-20 17:40:40.520241920+00:00
> I1120 17:40:40.520292  2483 process.cpp:2436] Resuming __gc__@127.0.0.1:45300 at 2015-11-20
17:40:40.520276992+00:00
> I1120 17:40:40.520308  2488 process.cpp:2541] Cleaning up __waiter__(1)@127.0.0.1:45300
> sh: perf: command not found
> -------------------------------------------------------------
> No 'perf' command found so no 'perf' tests will be run
> -------------------------------------------------------------
> which: no nc in (/opt/rh/devtoolset-2/root/usr/bin:/usr/local/bin:/bin:/usr/bin:/usr/local/sbin:/usr/sbin:/sbin:/home/vagrant/bin)
> -------------------------------------------------------------
> No 'nc' command found so no tests depending on 'nc' will run
> -------------------------------------------------------------
> Note: Google Test filter = CgroupsAnyHierarchyMemoryPressureTest.*-MesosContainerizerSlaveRecoveryTest.CGROUPS_ROOT_PerfRollForward:DockerContainerizerTest.ROOT_DOCKER_NC_PortMapping:PerfEventIsolatorTest.ROOT_CGROUPS_Sample:UserCgroupIsolatorTest/2.ROOT_CGROUPS_UserCgroup:CgroupsNoHierarchyTest.ROOT_CGROUPS_NOHIERARCHY_MountUnmountHierarchy:CgroupsAnyHierarchyWithPerfEventTest.ROOT_CGROUPS_Perf:PerfTest.ROOT_Events:PerfTest.ROOT_Sample:PerfTest.Parse:SlaveAndFrameworkCount/HierarchicalAllocator_BENCHMARK_Test.AddAndUpdateSlave/0:SlaveAndFrameworkCount/HierarchicalAllocator_BENCHMARK_Test.AddAndUpdateSlave/1:SlaveAndFrameworkCount/HierarchicalAllocator_BENCHMARK_Test.AddAndUpdateSlave/2:SlaveAndFrameworkCount/HierarchicalAllocator_BENCHMARK_Test.AddAndUpdateSlave/3:SlaveAndFrameworkCount/HierarchicalAllocator_BENCHMARK_Test.AddAndUpdateSlave/4:SlaveAndFrameworkCount/HierarchicalAllocator_BENCHMARK_Test.AddAndUpdateSlave/5:SlaveAndFrameworkCount/HierarchicalAllocator_BENCHMARK_Test.AddAndUpdateSlave/6:SlaveAndFrameworkCount/HierarchicalAllocator_BENCHMARK_Test.AddAndUpdateSlave/7:SlaveAndFrameworkCount/HierarchicalAllocator_BENCHMARK_Test.AddAndUpdateSlave/8:SlaveAndFrameworkCount/HierarchicalAllocator_BENCHMARK_Test.AddAndUpdateSlave/9:SlaveAndFrameworkCount/HierarchicalAllocator_BENCHMARK_Test.AddAndUpdateSlave/10:SlaveAndFrameworkCount/HierarchicalAllocator_BENCHMARK_Test.AddAndUpdateSlave/11:SlaveAndFrameworkCount/HierarchicalAllocator_BENCHMARK_Test.AddAndUpdateSlave/12:SlaveAndFrameworkCount/HierarchicalAllocator_BENCHMARK_Test.AddAndUpdateSlave/13:SlaveAndFrameworkCount/HierarchicalAllocator_BENCHMARK_Test.AddAndUpdateSlave/14:SlaveAndFrameworkCount/HierarchicalAllocator_BENCHMARK_Test.AddAndUpdateSlave/15:SlaveAndFrameworkCount/HierarchicalAllocator_BENCHMARK_Test.AddAndUpdateSlave/16:SlaveAndFrameworkCount/HierarchicalAllocator_BENCHMARK_Test.AddAndUpdateSlave/17:SlaveAndFrameworkCount/HierarchicalAllocator_BENCHMARK_Test.AddAndUpdateSlave/18:SlaveAndFrameworkCount/HierarchicalAllocator_BENCHMARK_Test.AddAndUpdateSlave/19:SlaveAndFrameworkCount/HierarchicalAllocator_BENCHMARK_Test.AddAndUpdateSlave/20:SlaveAndFrameworkCount/HierarchicalAllocator_BENCHMARK_Test.AddAndUpdateSlave/21:SlaveAndFrameworkCount/HierarchicalAllocator_BENCHMARK_Test.AddAndUpdateSlave/22:SlaveAndFrameworkCount/HierarchicalAllocator_BENCHMARK_Test.AddAndUpdateSlave/23:SlaveAndFrameworkCount/HierarchicalAllocator_BENCHMARK_Test.AddAndUpdateSlave/24:SlaveAndFrameworkCount/HierarchicalAllocator_BENCHMARK_Test.AddAndUpdateSlave/25:SlaveAndFrameworkCount/HierarchicalAllocator_BENCHMARK_Test.AddAndUpdateSlave/26:SlaveAndFrameworkCount/HierarchicalAllocator_BENCHMARK_Test.AddAndUpdateSlave/27:SlaveAndFrameworkCount/HierarchicalAllocator_BENCHMARK_Test.AddAndUpdateSlave/28:SlaveAndFrameworkCount/HierarchicalAllocator_BENCHMARK_Test.AddAndUpdateSlave/29:SlaveAndFrameworkCount/HierarchicalAllocator_BENCHMARK_Test.AddAndUpdateSlave/30:SlaveAndFrameworkCount/HierarchicalAllocator_BENCHMARK_Test.AddAndUpdateSlave/31:SlaveAndFrameworkCount/HierarchicalAllocator_BENCHMARK_Test.AddAndUpdateSlave/32:SlaveAndFrameworkCount/HierarchicalAllocator_BENCHMARK_Test.AddAndUpdateSlave/33:SlaveAndFrameworkCount/HierarchicalAllocator_BENCHMARK_Test.AddAndUpdateSlave/34:SlaveAndFrameworkCount/HierarchicalAllocator_BENCHMARK_Test.AddAndUpdateSlave/35:SlaveCount/Registrar_BENCHMARK_Test.Performance/0:SlaveCount/Registrar_BENCHMARK_Test.Performance/1:SlaveCount/Registrar_BENCHMARK_Test.Performance/2:SlaveCount/Registrar_BENCHMARK_Test.Performance/3
> [==========] Running 2 tests from 1 test case.
> [----------] Global test environment set-up.
> [----------] 2 tests from CgroupsAnyHierarchyMemoryPressureTest
> I1120 17:40:40.537535  2486 process.cpp:2436] Resuming __gc__@127.0.0.1:45300 at 2015-11-20
17:40:40.537511936+00:00
> I1120 17:40:40.537837  2488 process.cpp:2436] Resuming __latch__(2)@127.0.0.1:45300 at
2015-11-20 17:40:40.537793024+00:00
> I1120 17:40:40.537871  2467 process.cpp:2426] Spawned process __latch__(2)@127.0.0.1:45300
> [ RUN      ] CgroupsAnyHierarchyMemoryPressureTest.ROOT_IncreaseRSS
> I1120 17:40:40.538055  2482 process.cpp:2436] Resuming __latch__(2)@127.0.0.1:45300 at
2015-11-20 17:40:40.537982976+00:00
> I1120 17:40:40.538091  2482 process.cpp:2541] Cleaning up __latch__(2)@127.0.0.1:45300
> I1120 17:40:40.538171  2482 process.cpp:2436] Resuming __gc__@127.0.0.1:45300 at 2015-11-20
17:40:40.538168064+00:00
> I1120 17:40:40.541630  2482 process.cpp:2436] Resuming reaper(1)@127.0.0.1:45300 at 2015-11-20
17:40:40.541588992+00:00
> I1120 17:40:40.587157  2467 process.cpp:2426] Spawned process (1)@127.0.0.1:45300
> I1120 17:40:40.587370  2487 process.cpp:2436] Resuming (1)@127.0.0.1:45300 at 2015-11-20
17:40:40.587330048+00:00
> I1120 17:40:40.587493  2487 process.cpp:2426] Spawned process (2)@127.0.0.1:45300
> I1120 17:40:40.587522  2486 process.cpp:2436] Resuming (2)@127.0.0.1:45300 at 2015-11-20
17:40:40.587493888+00:00
> I1120 17:40:40.587822  2467 process.cpp:2426] Spawned process (3)@127.0.0.1:45300
> I1120 17:40:40.587875  2488 process.cpp:2436] Resuming (3)@127.0.0.1:45300 at 2015-11-20
17:40:40.587849984+00:00
> I1120 17:40:40.587910  2488 process.cpp:2426] Spawned process (4)@127.0.0.1:45300
> I1120 17:40:40.587971  2483 process.cpp:2436] Resuming (4)@127.0.0.1:45300 at 2015-11-20
17:40:40.587941888+00:00
> I1120 17:40:40.588297  2467 process.cpp:2426] Spawned process (5)@127.0.0.1:45300
> I1120 17:40:40.588381  2483 process.cpp:2436] Resuming (5)@127.0.0.1:45300 at 2015-11-20
17:40:40.588367104+00:00
> I1120 17:40:40.588449  2483 process.cpp:2426] Spawned process (6)@127.0.0.1:45300
> I1120 17:40:40.588673  2483 process.cpp:2436] Resuming (6)@127.0.0.1:45300 at 2015-11-20
17:40:40.588668160+00:00
> I1120 17:40:40.588685  2488 process.cpp:2436] Resuming (2)@127.0.0.1:45300 at 2015-11-20
17:40:40.588679168+00:00
> I1120 17:40:40.588754  2482 process.cpp:2436] Resuming (4)@127.0.0.1:45300 at 2015-11-20
17:40:40.588747008+00:00
> I1120 17:40:40.588907  2485 process.cpp:2436] Resuming (1)@127.0.0.1:45300 at 2015-11-20
17:40:40.588880896+00:00
> I1120 17:40:40.588975  2482 process.cpp:2436] Resuming (3)@127.0.0.1:45300 at 2015-11-20
17:40:40.588971008+00:00
> I1120 17:40:40.589048  2483 process.cpp:2436] Resuming (5)@127.0.0.1:45300 at 2015-11-20
17:40:40.589043968+00:00
> I1120 17:40:40.589345  2486 process.cpp:2436] Resuming (1)@127.0.0.1:45300 at 2015-11-20
17:40:40.589338112+00:00
> I1120 17:40:40.589375  2467 process.cpp:2426] Spawned process __latch__(3)@127.0.0.1:45300
> I1120 17:40:40.589411  2486 process.cpp:2436] Resuming (3)@127.0.0.1:45300 at 2015-11-20
17:40:40.589406976+00:00
> I1120 17:40:40.589442  2486 process.cpp:2436] Resuming (5)@127.0.0.1:45300 at 2015-11-20
17:40:40.589437952+00:00
> ../../src/tests/containerizer/cgroups_tests.cpp:1114: Failure
> (_low).failure(): Failed to register notification eventfd: Failed to open '/cgroup/memory/mesos_test/memory.pressure_level':
No such file or directory
> I1120 17:40:40.589474  2486 process.cpp:2436] Resuming __gc__@127.0.0.1:45300 at 2015-11-20
17:40:40.589470976+00:00
> I1120 17:40:40.589555  2486 process.cpp:2436] Resuming __latch__(3)@127.0.0.1:45300 at
2015-11-20 17:40:40.589550848+00:00
> I1120 17:40:40.589567  2486 process.cpp:2541] Cleaning up __latch__(3)@127.0.0.1:45300
> I1120 17:40:40.589627  2486 process.cpp:2436] Resuming __gc__@127.0.0.1:45300 at 2015-11-20
17:40:40.589624832+00:00
> I1120 17:40:40.599002  2467 process.cpp:2426] Spawned process __latch__(4)@127.0.0.1:45300
> I1120 17:40:40.599076  2486 process.cpp:2436] Resuming __gc__@127.0.0.1:45300 at 2015-11-20
17:40:40.599056896+00:00
> I1120 17:40:40.599216  2486 process.cpp:2436] Resuming __latch__(4)@127.0.0.1:45300 at
2015-11-20 17:40:40.599211008+00:00
> I1120 17:40:40.599228  2467 process.cpp:2734] Donating thread to (5)@127.0.0.1:45300
while waiting
> I1120 17:40:40.599272  2467 process.cpp:2436] Resuming (5)@127.0.0.1:45300 at 2015-11-20
17:40:40.599264000+00:00
> I1120 17:40:40.599237  2486 process.cpp:2541] Cleaning up __latch__(4)@127.0.0.1:45300
> I1120 17:40:40.599350  2489 process.cpp:2436] Resuming (6)@127.0.0.1:45300 at 2015-11-20
17:40:40.599312896+00:00
> I1120 17:40:40.599454  2489 process.cpp:2541] Cleaning up (6)@127.0.0.1:45300
> I1120 17:40:40.599581  2467 process.cpp:2541] Cleaning up (5)@127.0.0.1:45300
> I1120 17:40:40.599611  2486 process.cpp:2436] Resuming __gc__@127.0.0.1:45300 at 2015-11-20
17:40:40.599604992+00:00
> I1120 17:40:40.599828  2467 process.cpp:2734] Donating thread to (3)@127.0.0.1:45300
while waiting
> I1120 17:40:40.599848  2467 process.cpp:2436] Resuming (3)@127.0.0.1:45300 at 2015-11-20
17:40:40.599844864+00:00
> I1120 17:40:40.599918  2488 process.cpp:2436] Resuming (4)@127.0.0.1:45300 at 2015-11-20
17:40:40.599906816+00:00
> I1120 17:40:40.599947  2488 process.cpp:2541] Cleaning up (4)@127.0.0.1:45300
> I1120 17:40:40.600075  2467 process.cpp:2541] Cleaning up (3)@127.0.0.1:45300
> I1120 17:40:40.600208  2467 process.cpp:2734] Donating thread to (1)@127.0.0.1:45300
while waiting
> I1120 17:40:40.600245  2467 process.cpp:2436] Resuming (1)@127.0.0.1:45300 at 2015-11-20
17:40:40.600240896+00:00
> I1120 17:40:40.600285  2482 process.cpp:2436] Resuming (2)@127.0.0.1:45300 at 2015-11-20
17:40:40.600279040+00:00
> I1120 17:40:40.600334  2482 process.cpp:2541] Cleaning up (2)@127.0.0.1:45300
> I1120 17:40:40.601368  2467 process.cpp:2541] Cleaning up (1)@127.0.0.1:45300
> [  FAILED  ] CgroupsAnyHierarchyMemoryPressureTest.ROOT_IncreaseRSS (64 ms)
> [ RUN      ] CgroupsAnyHierarchyMemoryPressureTest.ROOT_IncreasePageCache
> I1120 17:40:40.605306  2485 process.cpp:2436] Resuming reaper(1)@127.0.0.1:45300 at 2015-11-20
17:40:40.605287168+00:00
> I1120 17:40:40.620676  2485 process.cpp:2436] Resuming reaper(1)@127.0.0.1:45300 at 2015-11-20
17:40:40.620659200+00:00
> I1120 17:40:40.648756  2467 process.cpp:2426] Spawned process (7)@127.0.0.1:45300
> I1120 17:40:40.648845  2485 process.cpp:2436] Resuming (7)@127.0.0.1:45300 at 2015-11-20
17:40:40.648823040+00:00
> I1120 17:40:40.648896  2485 process.cpp:2426] Spawned process (8)@127.0.0.1:45300
> I1120 17:40:40.648953  2485 process.cpp:2436] Resuming (8)@127.0.0.1:45300 at 2015-11-20
17:40:40.648950016+00:00
> I1120 17:40:40.649044  2485 process.cpp:2436] Resuming (7)@127.0.0.1:45300 at 2015-11-20
17:40:40.649039872+00:00
> I1120 17:40:40.649103  2467 process.cpp:2426] Spawned process (9)@127.0.0.1:45300
> I1120 17:40:40.649118  2483 process.cpp:2436] Resuming (9)@127.0.0.1:45300 at 2015-11-20
17:40:40.649099008+00:00
> I1120 17:40:40.649144  2483 process.cpp:2426] Spawned process (10)@127.0.0.1:45300
> I1120 17:40:40.649179  2488 process.cpp:2436] Resuming (10)@127.0.0.1:45300 at 2015-11-20
17:40:40.649157888+00:00
> I1120 17:40:40.649355  2488 process.cpp:2436] Resuming (9)@127.0.0.1:45300 at 2015-11-20
17:40:40.649349888+00:00
> I1120 17:40:40.649860  2467 process.cpp:2426] Spawned process (11)@127.0.0.1:45300
> I1120 17:40:40.649917  2483 process.cpp:2436] Resuming (11)@127.0.0.1:45300 at 2015-11-20
17:40:40.649907200+00:00
> I1120 17:40:40.649955  2483 process.cpp:2426] Spawned process (12)@127.0.0.1:45300
> I1120 17:40:40.649988  2483 process.cpp:2436] Resuming (12)@127.0.0.1:45300 at 2015-11-20
17:40:40.649986048+00:00
> I1120 17:40:40.650050  2483 process.cpp:2436] Resuming (11)@127.0.0.1:45300 at 2015-11-20
17:40:40.650046208+00:00
> I1120 17:40:40.662441  2467 process.cpp:2426] Spawned process __latch__(5)@127.0.0.1:45300
> I1120 17:40:40.662451  2485 process.cpp:2436] Resuming (9)@127.0.0.1:45300 at 2015-11-20
17:40:40.662447872+00:00
> I1120 17:40:40.662554  2485 process.cpp:2436] Resuming __gc__@127.0.0.1:45300 at 2015-11-20
17:40:40.662547200+00:00
> I1120 17:40:40.662557  2484 process.cpp:2436] Resuming (11)@127.0.0.1:45300 at 2015-11-20
17:40:40.662471936+00:00
> I1120 17:40:40.662606  2467 process.cpp:2426] Spawned process __waiter__(2)@127.0.0.1:45300
> I1120 17:40:40.662609  2484 process.cpp:2436] Resuming __latch__(5)@127.0.0.1:45300 at
2015-11-20 17:40:40.662605056+00:00
> I1120 17:40:40.662623  2484 process.cpp:2436] Resuming __waiter__(2)@127.0.0.1:45300
at 2015-11-20 17:40:40.662622976+00:00
> I1120 17:40:40.662441  2483 process.cpp:2436] Resuming (7)@127.0.0.1:45300 at 2015-11-20
17:40:40.662422016+00:00
> I1120 17:40:40.662724  2488 process.cpp:2436] Resuming __latch__(5)@127.0.0.1:45300 at
2015-11-20 17:40:40.662715904+00:00
> I1120 17:40:40.662751  2488 process.cpp:2541] Cleaning up __latch__(5)@127.0.0.1:45300
> I1120 17:40:40.662854  2483 process.cpp:2436] Resuming __waiter__(2)@127.0.0.1:45300
at 2015-11-20 17:40:40.662848000+00:00
> I1120 17:40:40.662860  2488 process.cpp:2436] Resuming __gc__@127.0.0.1:45300 at 2015-11-20
17:40:40.662856960+00:00
> I1120 17:40:40.662881  2483 process.cpp:2541] Cleaning up __waiter__(2)@127.0.0.1:45300
> ../../src/tests/containerizer/cgroups_tests.cpp:1196: Failure
> (_low).failure(): Failed to register notification eventfd: Failed to open '/cgroup/memory/mesos_test/memory.pressure_level':
No such file or directory
> I1120 17:40:40.672719  2467 process.cpp:2426] Spawned process __latch__(6)@127.0.0.1:45300
> I1120 17:40:40.672811  2488 process.cpp:2436] Resuming __gc__@127.0.0.1:45300 at 2015-11-20
17:40:40.672791040+00:00
> I1120 17:40:40.672854  2483 process.cpp:2436] Resuming __latch__(6)@127.0.0.1:45300 at
2015-11-20 17:40:40.672840960+00:00
> I1120 17:40:40.672884  2483 process.cpp:2541] Cleaning up __latch__(6)@127.0.0.1:45300
> I1120 17:40:40.673041  2483 process.cpp:2436] Resuming __gc__@127.0.0.1:45300 at 2015-11-20
17:40:40.673035008+00:00
> I1120 17:40:40.673184  2467 process.cpp:2734] Donating thread to (11)@127.0.0.1:45300
while waiting
> I1120 17:40:40.673208  2467 process.cpp:2436] Resuming (11)@127.0.0.1:45300 at 2015-11-20
17:40:40.673202944+00:00
> I1120 17:40:40.673267  2484 process.cpp:2436] Resuming (12)@127.0.0.1:45300 at 2015-11-20
17:40:40.673254912+00:00
> I1120 17:40:40.673300  2484 process.cpp:2541] Cleaning up (12)@127.0.0.1:45300
> I1120 17:40:40.673629  2467 process.cpp:2541] Cleaning up (11)@127.0.0.1:45300
> I1120 17:40:40.673749  2467 process.cpp:2734] Donating thread to (9)@127.0.0.1:45300
while waiting
> I1120 17:40:40.673768  2467 process.cpp:2436] Resuming (9)@127.0.0.1:45300 at 2015-11-20
17:40:40.673765888+00:00
> I1120 17:40:40.673852  2483 process.cpp:2436] Resuming (10)@127.0.0.1:45300 at 2015-11-20
17:40:40.673844224+00:00
> I1120 17:40:40.673876  2483 process.cpp:2541] Cleaning up (10)@127.0.0.1:45300
> I1120 17:40:40.674089  2467 process.cpp:2541] Cleaning up (9)@127.0.0.1:45300
> I1120 17:40:40.674255  2467 process.cpp:2734] Donating thread to (7)@127.0.0.1:45300
while waiting
> I1120 17:40:40.674294  2467 process.cpp:2436] Resuming (7)@127.0.0.1:45300 at 2015-11-20
17:40:40.674273024+00:00
> I1120 17:40:40.674350  2483 process.cpp:2436] Resuming (8)@127.0.0.1:45300 at 2015-11-20
17:40:40.674337024+00:00
> I1120 17:40:40.674381  2483 process.cpp:2541] Cleaning up (8)@127.0.0.1:45300
> I1120 17:40:40.674479  2467 process.cpp:2541] Cleaning up (7)@127.0.0.1:45300
> [  FAILED  ] CgroupsAnyHierarchyMemoryPressureTest.ROOT_IncreasePageCache (73 ms)
> I1120 17:40:40.674736  2467 process.cpp:2426] Spawned process __latch__(7)@127.0.0.1:45300
> [----------] 2 tests from CgroupsAnyHierarchyMemoryPressureTest (137 ms total)
> [----------] Global test environment tear-down
> I1120 17:40:40.674801  2484 process.cpp:2436] Resuming __gc__@127.0.0.1:45300 at 2015-11-20
17:40:40.674788864+00:00
> I1120 17:40:40.674897  2484 process.cpp:2436] Resuming __latch__(7)@127.0.0.1:45300 at
2015-11-20 17:40:40.674892800+00:00
> I1120 17:40:40.674914  2484 process.cpp:2541] Cleaning up __latch__(7)@127.0.0.1:45300
> I1120 17:40:40.674960  2484 process.cpp:2436] Resuming __gc__@127.0.0.1:45300 at 2015-11-20
17:40:40.674958080+00:00
> [==========] 2 tests from 1 test case ran. (143 ms total)
> [  PASSED  ] 0 tests.
> [  FAILED  ] 2 tests, listed below:
> [  FAILED  ] CgroupsAnyHierarchyMemoryPressureTest.ROOT_IncreaseRSS
> [  FAILED  ] CgroupsAnyHierarchyMemoryPressureTest.ROOT_IncreasePageCache
>  2 FAILED TESTS
> {noformat}
> The Vagrant generator script:
> {noformat}
> cat << EOF > Vagrantfile
> # -*- mode: ruby -*-" >
> # vi: set ft=ruby :
> Vagrant.configure(2) do |config|
>   # Disable shared folder to prevent certain kernel module dependencies.
>   config.vm.synced_folder ".", "/vagrant", disabled: true
>   config.vm.hostname = "centos67"
>   config.vm.box = "bento/centos-6.7"
>   config.vm.provider "virtualbox" do |vb|
>     vb.memory = 16384
>     vb.cpus = 8
>   end
>   config.vm.provider "vmware_fusion" do |vb|
>     vb.memory = 9216
>     vb.cpus = 4
>   end
>   config.vm.provision "shell", inline: <<-SHELL
>     # Kernel 3.10 (required by Docker 1.9 -- without it, all we get is Docker 1.7.1):
>     #sudo rpm --import https://www.elrepo.org/RPM-GPG-KEY-elrepo.org
>     #sudo rpm -Uvh http://www.elrepo.org/elrepo-release-6-6.el6.elrepo.noarch.rpm
>     #sudo yum --enablerepo=elrepo-kernel install -y kernel-lt
>     #sudo sed -i "s/default=1/default=0/g" /etc/grub.conf
>     #sudo sed -i "s/default=1/default=0/g" /boot/grub/grub.conf
>     #echo "SELINUX=disabled" > config
>     #echo "SELINUXTYPE=targeted" >> config
>     #sudo mv config /etc/selinux
>     #sudo yum install -y http://ftp.riken.jp/Linux/fedora/epel/6/i386/epel-release-6-8.noarch.rpm
>     #(cd /etc/yum.repos.d; sudo wget http://www.hop5.in/yum/el6/hop5.repo)
>     # gcc 4.8 (required by Mesos):
>     sudo wget http://people.centos.org/tru/devtools-2/devtools-2.repo -O /etc/yum.repos.d/devtools-2.repo
>     sudo yum install -y devtoolset-2-gcc devtoolset-2-binutils devtoolset-2-gcc-c++
>     # Docker:
>     sudo wget -qO- https://get.docker.com/ | sh
>     cp /etc/fstab .
>     echo "none                    /sys/fs/cgroup          cgroup  defaults        0 0"
>> fstab
>     sudo mv fstab /etc/
>     sudo yum install -y tar wget
>     sudo wget http://repos.fedorapeople.org/repos/dchen/apache-maven/epel-apache-maven.repo
-O /etc/yum.repos.d/epel-apache-maven.repo
>     sudo yum groupinstall -y "Development Tools"
>     sudo yum install -y apache-maven python-devel java-1.7.0-openjdk-devel zlib-devel
libcurl-devel openssl-devel cyrus-sasl-devel cyrus-sasl-md5 apr-devel subversion-devel apr-util-devel
>     sudo yum install -y git
>     sudo docker info
>   SHELL
> end
> EOF
> vagrant up
> vagrant reload
> vagrant ssh -c "
> scl enable devtoolset-2 bash
> git clone  https://github.com/apache/mesos.git mesos
> cd mesos
> git checkout -b 0.26.0-rc1 0.26.0-rc1
> ./bootstrap
> mkdir build
> cd build
> ../configure
> make -j4 check
> sudo ./bin/mesos-tests.sh
> "
> {noformat}



--
This message was sent by Atlassian JIRA
(v6.3.4#6332)

Mime
View raw message