mesos-issues mailing list archives

Site index · List index
Message view « Date » · « Thread »
Top « Date » · « Thread »
From "Marco Massenzio (JIRA)" <j...@apache.org>
Subject [jira] [Updated] (MESOS-3295) Failing ROOT_ tests on CentOS 7.1 - ContainerizerTest.ROOT_CGROUPS_BalloonFramework
Date Tue, 18 Aug 2015 23:48:45 GMT

     [ https://issues.apache.org/jira/browse/MESOS-3295?page=com.atlassian.jira.plugin.system.issuetabpanels:all-tabpanel
]

Marco Massenzio updated MESOS-3295:
-----------------------------------
    Description: 
h2. ContainerizerTest.ROOT_CGROUPS_BalloonFramework

This is one of several ROOT failing tests: we want to track them *individually* and for each
of them decide whether to:

* fix;
* remove; OR
* redesign.

(full verbose logs attached)

h2. Steps to Reproduce

Completely cleaned the build, removed directory, clean pull from {{master}} (SHA: {{fb93d93}})
- same results, 9 failed tests:

{noformat}
[==========] 751 tests from 114 test cases ran. (231218 ms total)
[  PASSED  ] 742 tests.
[  FAILED  ] 9 tests, listed below:
[  FAILED  ] LimitedCpuIsolatorTest.ROOT_CGROUPS_Pids_and_Tids
[  FAILED  ] UserCgroupIsolatorTest/1.ROOT_CGROUPS_UserCgroup, where TypeParam = mesos::internal::slave::CgroupsCpushareIsolatorProcess
[  FAILED  ] ContainerizerTest.ROOT_CGROUPS_BalloonFramework
[  FAILED  ] LinuxFilesystemIsolatorTest.ROOT_ChangeRootFilesystem
[  FAILED  ] LinuxFilesystemIsolatorTest.ROOT_VolumeFromSandbox
[  FAILED  ] LinuxFilesystemIsolatorTest.ROOT_VolumeFromHost
[  FAILED  ] LinuxFilesystemIsolatorTest.ROOT_VolumeFromHostSandboxMountPoint
[  FAILED  ] LinuxFilesystemIsolatorTest.ROOT_PersistentVolumeWithRootFilesystem
[  FAILED  ] MesosContainerizerLaunchTest.ROOT_ChangeRootfs

 9 FAILED TESTS
  YOU HAVE 10 DISABLED TESTS
{noformat}

  was:
h2. UserCgroupIsolatorTest

This is one of several ROOT failing tests: we want to track them *individually* and for each
of them decide whether to:

* fix;
* remove; OR
* redesign.

(full verbose logs attached)

h2. Steps to Reproduce

Completely cleaned the build, removed directory, clean pull from {{master}} (SHA: {{fb93d93}})
- same results, 9 failed tests:

{noformat}
[==========] 751 tests from 114 test cases ran. (231218 ms total)
[  PASSED  ] 742 tests.
[  FAILED  ] 9 tests, listed below:
[  FAILED  ] LimitedCpuIsolatorTest.ROOT_CGROUPS_Pids_and_Tids
[  FAILED  ] UserCgroupIsolatorTest/1.ROOT_CGROUPS_UserCgroup, where TypeParam = mesos::internal::slave::CgroupsCpushareIsolatorProcess
[  FAILED  ] ContainerizerTest.ROOT_CGROUPS_BalloonFramework
[  FAILED  ] LinuxFilesystemIsolatorTest.ROOT_ChangeRootFilesystem
[  FAILED  ] LinuxFilesystemIsolatorTest.ROOT_VolumeFromSandbox
[  FAILED  ] LinuxFilesystemIsolatorTest.ROOT_VolumeFromHost
[  FAILED  ] LinuxFilesystemIsolatorTest.ROOT_VolumeFromHostSandboxMountPoint
[  FAILED  ] LinuxFilesystemIsolatorTest.ROOT_PersistentVolumeWithRootFilesystem
[  FAILED  ] MesosContainerizerLaunchTest.ROOT_ChangeRootfs

 9 FAILED TESTS
  YOU HAVE 10 DISABLED TESTS
{noformat}


> Failing ROOT_ tests on CentOS 7.1 - ContainerizerTest.ROOT_CGROUPS_BalloonFramework
> -----------------------------------------------------------------------------------
>
>                 Key: MESOS-3295
>                 URL: https://issues.apache.org/jira/browse/MESOS-3295
>             Project: Mesos
>          Issue Type: Bug
>          Components: containerization, docker, test
>    Affects Versions: 0.23.0, 0.24.0
>         Environment: CentOS Linux release 7.1
> Linux 3.10.0
>            Reporter: Marco Massenzio
>            Priority: Blocker
>              Labels: mesosphere, tech-debt
>
> h2. ContainerizerTest.ROOT_CGROUPS_BalloonFramework
> This is one of several ROOT failing tests: we want to track them *individually* and for
each of them decide whether to:
> * fix;
> * remove; OR
> * redesign.
> (full verbose logs attached)
> h2. Steps to Reproduce
> Completely cleaned the build, removed directory, clean pull from {{master}} (SHA: {{fb93d93}})
- same results, 9 failed tests:
> {noformat}
> [==========] 751 tests from 114 test cases ran. (231218 ms total)
> [  PASSED  ] 742 tests.
> [  FAILED  ] 9 tests, listed below:
> [  FAILED  ] LimitedCpuIsolatorTest.ROOT_CGROUPS_Pids_and_Tids
> [  FAILED  ] UserCgroupIsolatorTest/1.ROOT_CGROUPS_UserCgroup, where TypeParam = mesos::internal::slave::CgroupsCpushareIsolatorProcess
> [  FAILED  ] ContainerizerTest.ROOT_CGROUPS_BalloonFramework
> [  FAILED  ] LinuxFilesystemIsolatorTest.ROOT_ChangeRootFilesystem
> [  FAILED  ] LinuxFilesystemIsolatorTest.ROOT_VolumeFromSandbox
> [  FAILED  ] LinuxFilesystemIsolatorTest.ROOT_VolumeFromHost
> [  FAILED  ] LinuxFilesystemIsolatorTest.ROOT_VolumeFromHostSandboxMountPoint
> [  FAILED  ] LinuxFilesystemIsolatorTest.ROOT_PersistentVolumeWithRootFilesystem
> [  FAILED  ] MesosContainerizerLaunchTest.ROOT_ChangeRootfs
>  9 FAILED TESTS
>   YOU HAVE 10 DISABLED TESTS
> {noformat}



--
This message was sent by Atlassian JIRA
(v6.3.4#6332)

Mime
View raw message