mesos-issues mailing list archives

Site index · List index
Message view « Date » · « Thread »
Top « Date » · « Thread »
From "Joerg Schad (JIRA)" <j...@apache.org>
Subject [jira] [Commented] (MESOS-3079) {{sudo make distcheck}} fails on Ubuntu 14.04 (and possibly other OSes too)
Date Sun, 19 Jul 2015 15:48:04 GMT

    [ https://issues.apache.org/jira/browse/MESOS-3079?page=com.atlassian.jira.plugin.system.issuetabpanels:comment-tabpanel&focusedCommentId=14632846#comment-14632846
] 

Joerg Schad commented on MESOS-3079:
------------------------------------

The perf issues are solved with Isabelle's Patch:  https://reviews.apache.org/r/32384

> {{sudo make distcheck}} fails on Ubuntu 14.04 (and possibly other OSes too)
> ---------------------------------------------------------------------------
>
>                 Key: MESOS-3079
>                 URL: https://issues.apache.org/jira/browse/MESOS-3079
>             Project: Mesos
>          Issue Type: Bug
>    Affects Versions: 0.23.0-rc4
>            Reporter: Marco Massenzio
>            Assignee: Adam B
>            Priority: Blocker
>              Labels: mesosphere, tests
>         Attachments: test-results.log
>
>
> Running tests as root causes a large number of failures.
> {noformat}
> $ lsb_release -a
> LSB Version:    core-2.0-amd64:core-2.0-noarch:core-3.0-amd64:core-3.0-noarch:core-3.1-amd64:core-3.1-noarch:core-3.2-amd64:core-3.2-noarch:core-4.0-amd64:core-4.0-noarch:core-4.1-amd64:core-4.1-noarch:cxx-3.0-amd64:cxx-3.0-noarch:cxx-3.1-amd64:cxx-3.1-noarch:cxx-3.2-amd64:cxx-3.2-noarch:cxx-4.0-amd64:cxx-4.0-noarch:cxx-4.1-amd64:cxx-4.1-noarch:desktop-3.1-amd64:desktop-3.1-noarch:desktop-3.2-amd64:desktop-3.2-noarch:desktop-4.0-amd64:desktop-4.0-noarch:desktop-4.1-amd64:desktop-4.1-noarch:graphics-2.0-amd64:graphics-2.0-noarch:graphics-3.0-amd64:graphics-3.0-noarch:graphics-3.1-amd64:graphics-3.1-noarch:graphics-3.2-amd64:graphics-3.2-noarch:graphics-4.0-amd64:graphics-4.0-noarch:graphics-4.1-amd64:graphics-4.1-noarch:languages-3.2-amd64:languages-3.2-noarch:languages-4.0-amd64:languages-4.0-noarch:languages-4.1-amd64:languages-4.1-noarch:multimedia-3.2-amd64:multimedia-3.2-noarch:multimedia-4.0-amd64:multimedia-4.0-noarch:multimedia-4.1-amd64:multimedia-4.1-noarch:printing-3.2-amd64:printing-3.2-noarch:printing-4.0-amd64:printing-4.0-noarch:printing-4.1-amd64:printing-4.1-noarch:qt4-3.1-amd64:qt4-3.1-noarch:security-4.0-amd64:security-4.0-noarch:security-4.1-amd64:security-4.1-noarch
> Distributor ID: Ubuntu
> Description:    Ubuntu 14.04.2 LTS
> Release:        14.04
> Codename:       trusty
> $ sudo make -j12 V=0 check
> [==========] 712 tests from 116 test cases ran. (318672 ms total)
> [  PASSED  ] 676 tests.
> [  FAILED  ] 36 tests, listed below:
> [  FAILED  ] PerfEventIsolatorTest.ROOT_CGROUPS_Sample
> [  FAILED  ] UserCgroupIsolatorTest/2.ROOT_CGROUPS_UserCgroup, where TypeParam = mesos::internal::slave::CgroupsPerfEventIsolatorProcess
> [  FAILED  ] SlaveRecoveryTest/0.RecoverSlaveState, where TypeParam = mesos::internal::slave::MesosContainerizer
> [  FAILED  ] SlaveRecoveryTest/0.RecoverStatusUpdateManager, where TypeParam = mesos::internal::slave::MesosContainerizer
> [  FAILED  ] SlaveRecoveryTest/0.ReconnectExecutor, where TypeParam = mesos::internal::slave::MesosContainerizer
> [  FAILED  ] SlaveRecoveryTest/0.RecoverUnregisteredExecutor, where TypeParam = mesos::internal::slave::MesosContainerizer
> [  FAILED  ] SlaveRecoveryTest/0.RecoverTerminatedExecutor, where TypeParam = mesos::internal::slave::MesosContainerizer
> [  FAILED  ] SlaveRecoveryTest/0.RecoverCompletedExecutor, where TypeParam = mesos::internal::slave::MesosContainerizer
> [  FAILED  ] SlaveRecoveryTest/0.CleanupExecutor, where TypeParam = mesos::internal::slave::MesosContainerizer
> [  FAILED  ] SlaveRecoveryTest/0.RemoveNonCheckpointingFramework, where TypeParam = mesos::internal::slave::MesosContainerizer
> [  FAILED  ] SlaveRecoveryTest/0.NonCheckpointingFramework, where TypeParam = mesos::internal::slave::MesosContainerizer
> [  FAILED  ] SlaveRecoveryTest/0.KillTask, where TypeParam = mesos::internal::slave::MesosContainerizer
> [  FAILED  ] SlaveRecoveryTest/0.Reboot, where TypeParam = mesos::internal::slave::MesosContainerizer
> [  FAILED  ] SlaveRecoveryTest/0.GCExecutor, where TypeParam = mesos::internal::slave::MesosContainerizer
> [  FAILED  ] SlaveRecoveryTest/0.ShutdownSlave, where TypeParam = mesos::internal::slave::MesosContainerizer
> [  FAILED  ] SlaveRecoveryTest/0.ShutdownSlaveSIGUSR1, where TypeParam = mesos::internal::slave::MesosContainerizer
> [  FAILED  ] SlaveRecoveryTest/0.RegisterDisconnectedSlave, where TypeParam = mesos::internal::slave::MesosContainerizer
> [  FAILED  ] SlaveRecoveryTest/0.ReconcileKillTask, where TypeParam = mesos::internal::slave::MesosContainerizer
> [  FAILED  ] SlaveRecoveryTest/0.ReconcileShutdownFramework, where TypeParam = mesos::internal::slave::MesosContainerizer
> [  FAILED  ] SlaveRecoveryTest/0.ReconcileTasksMissingFromSlave, where TypeParam = mesos::internal::slave::MesosContainerizer
> [  FAILED  ] SlaveRecoveryTest/0.SchedulerFailover, where TypeParam = mesos::internal::slave::MesosContainerizer
> [  FAILED  ] SlaveRecoveryTest/0.PartitionedSlave, where TypeParam = mesos::internal::slave::MesosContainerizer
> [  FAILED  ] SlaveRecoveryTest/0.MasterFailover, where TypeParam = mesos::internal::slave::MesosContainerizer
> [  FAILED  ] SlaveRecoveryTest/0.MultipleFrameworks, where TypeParam = mesos::internal::slave::MesosContainerizer
> [  FAILED  ] SlaveRecoveryTest/0.MultipleSlaves, where TypeParam = mesos::internal::slave::MesosContainerizer
> [  FAILED  ] SlaveRecoveryTest/0.RestartBeforeContainerizerLaunch, where TypeParam =
mesos::internal::slave::MesosContainerizer
> [  FAILED  ] MesosContainerizerSlaveRecoveryTest.ResourceStatistics
> [  FAILED  ] MesosContainerizerSlaveRecoveryTest.CGROUPS_ROOT_PerfRollForward
> [  FAILED  ] MesosContainerizerSlaveRecoveryTest.CGROUPS_ROOT_PidNamespaceForward
> [  FAILED  ] MesosContainerizerSlaveRecoveryTest.CGROUPS_ROOT_PidNamespaceBackward
> [  FAILED  ] CgroupsAnyHierarchyWithPerfEventTest.ROOT_CGROUPS_Perf
> [  FAILED  ] MemoryPressureMesosTest.CGROUPS_ROOT_Statistics
> [  FAILED  ] MemoryPressureMesosTest.CGROUPS_ROOT_SlaveRecovery
> [  FAILED  ] NsTest.ROOT_setns
> [  FAILED  ] PerfTest.ROOT_Events
> [  FAILED  ] PerfTest.ROOT_SamplePid
> 36 FAILED TESTS
> {noformat}
> Full log attached.



--
This message was sent by Atlassian JIRA
(v6.3.4#6332)

Mime
View raw message