mesos-issues mailing list archives

Site index · List index
Message view « Date » · « Thread »
Top « Date » · « Thread »
From "Vinod Kone (JIRA)" <j...@apache.org>
Subject [jira] [Assigned] (MESOS-1698) make check segfaults
Date Wed, 03 Sep 2014 17:55:52 GMT

     [ https://issues.apache.org/jira/browse/MESOS-1698?page=com.atlassian.jira.plugin.system.issuetabpanels:all-tabpanel
]

Vinod Kone reassigned MESOS-1698:
---------------------------------

    Assignee: Jie Yu  (was: Vinod Kone)

assigning to [~jieyu] as he kindly offered to help out.

> make check segfaults
> --------------------
>
>                 Key: MESOS-1698
>                 URL: https://issues.apache.org/jira/browse/MESOS-1698
>             Project: Mesos
>          Issue Type: Bug
>          Components: test
>         Environment: Ubuntu
>            Reporter: Vinod Kone
>            Assignee: Jie Yu
>
> Observed this on Apache CI: https://builds.apache.org/job/Mesos-Trunk-Ubuntu-Build-Out-Of-Src-Set-JAVA_HOME/2331/consoleFull
> It looks like the segfault happens before any tests are run. So I suspect somewhere in
the setup phase of the tests.
> {code}
> mv -f .deps/tests-time_tests.Tpo .deps/tests-time_tests.Po
> /bin/bash ./libtool  --tag=CXX   --mode=link g++  -g -g2 -O2 -Wno-unused-local-typedefs
-std=c++11   -o tests tests-decoder_tests.o tests-encoder_tests.o tests-http_tests.o tests-io_tests.o
tests-main.o tests-mutex_tests.o tests-metrics_tests.o tests-owned_tests.o tests-process_tests.o
tests-queue_tests.o tests-reap_tests.o tests-sequence_tests.o tests-shared_tests.o tests-statistics_tests.o
tests-subprocess_tests.o tests-system_tests.o tests-timeseries_tests.o tests-time_tests.o
3rdparty/libgmock.la libprocess.la 3rdparty/glog-0.3.3/libglog.la 3rdparty/libry_http_parser.la
3rdparty/libev-4.15/libev.la -lz  -lrt
> libtool: link: g++ -g -g2 -O2 -Wno-unused-local-typedefs -std=c++11 -o tests tests-decoder_tests.o
tests-encoder_tests.o tests-http_tests.o tests-io_tests.o tests-main.o tests-mutex_tests.o
tests-metrics_tests.o tests-owned_tests.o tests-process_tests.o tests-queue_tests.o tests-reap_tests.o
tests-sequence_tests.o tests-shared_tests.o tests-statistics_tests.o tests-subprocess_tests.o
tests-system_tests.o tests-timeseries_tests.o tests-time_tests.o  3rdparty/.libs/libgmock.a
./.libs/libprocess.a /home/jenkins/jenkins-slave/workspace/Mesos-Trunk-Ubuntu-Build-Out-Of-Src-Set-JAVA_HOME/build/3rdparty/libprocess/3rdparty/glog-0.3.3/.libs/libglog.a
/home/jenkins/jenkins-slave/workspace/Mesos-Trunk-Ubuntu-Build-Out-Of-Src-Set-JAVA_HOME/build/3rdparty/libprocess/3rdparty/libev-4.15/.libs/libev.a
3rdparty/glog-0.3.3/.libs/libglog.a -lpthread 3rdparty/.libs/libry_http_parser.a 3rdparty/libev-4.15/.libs/libev.a
-lm -lz -lrt
> make[5]: Leaving directory `/home/jenkins/jenkins-slave/workspace/Mesos-Trunk-Ubuntu-Build-Out-Of-Src-Set-JAVA_HOME/build/3rdparty/libprocess'
> make  check-local
> make[5]: Entering directory `/home/jenkins/jenkins-slave/workspace/Mesos-Trunk-Ubuntu-Build-Out-Of-Src-Set-JAVA_HOME/build/3rdparty/libprocess'
> ./tests
> Note: Google Test filter = 
> [==========] Running 0 tests from 0 test cases.
> [==========] 0 tests from 0 test cases ran. (0 ms total)
> [  PASSED  ] 0 tests.
>   YOU HAVE 3 DISABLED TESTS
> make[5]: *** [check-local] Segmentation fault
> make[5]: Leaving directory `/home/jenkins/jenkins-slave/workspace/Mesos-Trunk-Ubuntu-Build-Out-Of-Src-Set-JAVA_HOME/build/3rdparty/libprocess'
> make[4]: *** [check-am] Error 2
> make[4]: Leaving directory `/home/jenkins/jenkins-slave/workspace/Mesos-Trunk-Ubuntu-Build-Out-Of-Src-Set-JAVA_HOME/build/3rdparty/libprocess'
> make[3]: *** [check-recursive] Error 1
> make[3]: Leaving directory `/home/jenkins/jenkins-slave/workspace/Mesos-Trunk-Ubuntu-Build-Out-Of-Src-Set-JAVA_HOME/build/3rdparty/libprocess'
> make[2]: *** [check-recursive] Error 1
> make[2]: Leaving directory `/home/jenkins/jenkins-slave/workspace/Mesos-Trunk-Ubuntu-Build-Out-Of-Src-Set-JAVA_HOME/build/3rdparty'
> make[1]: *** [check] Error 2
> make[1]: Leaving directory `/home/jenkins/jenkins-slave/workspace/Mesos-Trunk-Ubuntu-Build-Out-Of-Src-Set-JAVA_HOME/build/3rdparty'
> make: *** [check-recursive] Error 1
> Build step 'Execute shell' marked build as failure
> Sending e-mails to: dev@mesos.apache.org benjamin.hindman@gmail.com dhamon@twitter.com
yujie.jay@gmail.com
> Finished: FAILURE
> {code}



--
This message was sent by Atlassian JIRA
(v6.3.4#6332)

Mime
View raw message