mesos-dev mailing list archives

Site index · List index
Message view « Date » · « Thread »
Top « Date » · « Thread »
From Apache Jenkins Server <jenk...@builds.apache.org>
Subject Build failed in Jenkins: Mesos-Trunk-Ubuntu-Build-Out-Of-Src-Disable-Java-Disable-Python-Disable-Webui #2570
Date Mon, 17 Nov 2014 22:40:22 GMT
See <https://builds.apache.org/job/Mesos-Trunk-Ubuntu-Build-Out-Of-Src-Disable-Java-Disable-Python-Disable-Webui/2570/changes>

Changes:

[toenshoff] Fix compilation error for Socket on older linux + OSX.

------------------------------------------
[...truncated 27328 lines...]
I1117 22:11:41.100460 27821 status_update_manager.cpp:178] Resuming sending status updates
I1117 22:11:41.100468 27826 hierarchical_allocator_process.hpp:679] Performed allocation for
slave 20141117-221140-3176252227-47938-27806-S0 in 53845ns
I1117 22:11:41.100728 27823 replica.cpp:508] Replica received write request for position 4
I1117 22:11:41.101296 27823 leveldb.cpp:343] Persisting action (16 bytes) to leveldb took
537857ns
I1117 22:11:41.101325 27823 replica.cpp:676] Persisted action at 4
I1117 22:11:41.101981 27826 replica.cpp:655] Replica received learned notice for position
4
I1117 22:11:41.102471 27826 leveldb.cpp:343] Persisting action (18 bytes) to leveldb took
464140ns
I1117 22:11:41.102543 27826 leveldb.cpp:401] Deleting ~2 keys from leveldb took 46273ns
I1117 22:11:41.102565 27826 replica.cpp:676] Persisted action at 4
I1117 22:11:41.102587 27826 replica.cpp:661] Replica learned TRUNCATE action at position 4
I1117 22:11:41.111270 27829 master.cpp:126] No whitelist given. Advertising offers for all
slaves
I1117 22:11:41.111387 27831 hierarchical_allocator_process.hpp:659] Performed allocation for
1 slaves in 66460ns
I1117 22:11:41.111450 27826 slave.cpp:2630] No pings from master received within 75secs
I1117 22:11:41.111614 27826 slave.cpp:3338] Current usage 7.09%. Max allowed age: 5.803358538522963days
I1117 22:11:41.111822 27826 slave.cpp:596] Re-detecting master
I1117 22:11:41.111843 27826 slave.cpp:643] Detecting new master
I1117 22:11:41.111860 27825 status_update_manager.cpp:171] Pausing sending status updates
I1117 22:11:41.112207 27825 slave.cpp:607] New master detected at master@67.195.81.189:47938
I1117 22:11:41.112224 27830 status_update_manager.cpp:171] Pausing sending status updates
I1117 22:11:41.112248 27825 slave.cpp:670] Authenticating with master master@67.195.81.189:47938
I1117 22:11:41.112264 27825 slave.cpp:675] Using default CRAM-MD5 authenticatee
I1117 22:11:41.112437 27825 slave.cpp:643] Detecting new master
I1117 22:11:41.112555 27832 authenticatee.hpp:138] Creating new client SASL connection
I1117 22:11:41.112799 27824 master.cpp:3896] Authenticating slave(61)@67.195.81.189:47938
I1117 22:11:41.112839 27824 master.cpp:3907] Using default CRAM-MD5 authenticator
I1117 22:11:41.113123 27834 authenticator.hpp:170] Creating new server SASL connection
I1117 22:11:41.113337 27827 authenticatee.hpp:229] Received SASL authentication mechanisms:
CRAM-MD5
I1117 22:11:41.113365 27827 authenticatee.hpp:255] Attempting to authenticate with mechanism
'CRAM-MD5'
I1117 22:11:41.113476 27825 authenticator.hpp:276] Received SASL authentication start
I1117 22:11:41.113529 27825 authenticator.hpp:398] Authentication requires more steps
I1117 22:11:41.113643 27827 authenticatee.hpp:275] Received SASL authentication step
I1117 22:11:41.113765 27822 authenticator.hpp:304] Received SASL authentication step
I1117 22:11:41.113792 27822 auxprop.cpp:99] Request to lookup properties for user: 'test-principal'
realm: 'proserpina.apache.org' server FQDN: 'proserpina.apache.org' SASL_AUXPROP_VERIFY_AGAINST_HASH:
false SASL_AUXPROP_OVERRIDE: false SASL_AUXPROP_AUTHZID: false 
I1117 22:11:41.113804 27822 auxprop.cpp:171] Looking up auxiliary property '*userPassword'
I1117 22:11:41.113834 27822 auxprop.cpp:171] Looking up auxiliary property '*cmusaslsecretCRAM-MD5'
I1117 22:11:41.113858 27822 auxprop.cpp:99] Request to lookup properties for user: 'test-principal'
realm: 'proserpina.apache.org' server FQDN: 'proserpina.apache.org' SASL_AUXPROP_VERIFY_AGAINST_HASH:
false SASL_AUXPROP_OVERRIDE: false SASL_AUXPROP_AUTHZID: true 
I1117 22:11:43.021765 27822 auxprop.cpp:121] Skipping auxiliary property '*userPassword' since
SASL_AUXPROP_AUTHZID == true
I1117 22:11:43.021839 27822 auxprop.cpp:121] Skipping auxiliary property '*cmusaslsecretCRAM-MD5'
since SASL_AUXPROP_AUTHZID == true
I1117 22:11:43.021911 27822 authenticator.hpp:390] Authentication success
I1117 22:11:43.022438 27827 authenticatee.hpp:315] Authentication success
I1117 22:11:43.022557 27831 master.cpp:3954] Successfully authenticated principal 'test-principal'
at slave(61)@67.195.81.189:47938
I1117 22:11:43.023183 27827 slave.cpp:741] Successfully authenticated with master master@67.195.81.189:47938
I1117 22:11:43.023394 27827 slave.cpp:1069] Will retry registration in 529829ns if necessary
I1117 22:11:43.023730 27823 master.cpp:3190] Re-registering slave 20141117-221140-3176252227-47938-27806-S0
at slave(61)@67.195.81.189:47938 (proserpina.apache.org)
I1117 22:11:43.024210 27821 slave.cpp:843] Re-registered with master master@67.195.81.189:47938
I1117 22:11:43.024353 27827 status_update_manager.cpp:178] Resuming sending status updates
I1117 22:11:43.044641 27806 master.cpp:698] Master terminating
I1117 22:11:43.045341 27827 slave.cpp:2640] master@67.195.81.189:47938 exited
W1117 22:11:43.045377 27827 slave.cpp:2643] Master disconnected! Waiting for a new master
to be elected
I1117 22:11:43.073277 27806 slave.cpp:489] Slave terminating
[       OK ] SlaveTest.PingTimeoutNoPings (2434 ms)
[ RUN      ] SlaveTest.MetricsInStatsEndpoint
Using temporary directory '/tmp/SlaveTest_MetricsInStatsEndpoint_Q9eHik'
I1117 22:11:43.085679 27806 leveldb.cpp:176] Opened db in 3.167781ms
I1117 22:11:43.086735 27806 leveldb.cpp:183] Compacted db in 1.024276ms
I1117 22:11:43.086787 27806 leveldb.cpp:198] Created db iterator in 16887ns
I1117 22:11:43.086807 27806 leveldb.cpp:204] Seeked to beginning of db in 1930ns
I1117 22:11:43.086817 27806 leveldb.cpp:273] Iterated through 0 keys in the db in 298ns
I1117 22:11:43.086853 27806 replica.cpp:741] Replica recovered with log positions 0 ->
0 with 1 holes and 0 unlearned
I1117 22:11:43.087431 27829 recover.cpp:437] Starting replica recovery
I1117 22:11:43.087690 27829 recover.cpp:463] Replica is in EMPTY status
I1117 22:11:43.089407 27831 replica.cpp:638] Replica in EMPTY status received a broadcasted
recover request
I1117 22:11:43.089948 27829 recover.cpp:188] Received a recover response from a replica in
EMPTY status
I1117 22:11:43.090502 27835 recover.cpp:554] Updating replica status to STARTING
I1117 22:11:43.091338 27821 leveldb.cpp:306] Persisting metadata (8 bytes) to leveldb took
721387ns
I1117 22:11:43.091372 27821 replica.cpp:320] Persisted replica status to STARTING
I1117 22:11:43.091732 27829 recover.cpp:463] Replica is in STARTING status
I1117 22:11:43.093473 27820 replica.cpp:638] Replica in STARTING status received a broadcasted
recover request
I1117 22:11:43.093982 27821 recover.cpp:188] Received a recover response from a replica in
STARTING status
I1117 22:11:43.094831 27822 recover.cpp:554] Updating replica status to VOTING
I1117 22:11:43.095793 27833 leveldb.cpp:306] Persisting metadata (8 bytes) to leveldb took
611924ns
I1117 22:11:43.095820 27833 replica.cpp:320] Persisted replica status to VOTING
I1117 22:11:43.096015 27830 recover.cpp:568] Successfully joined the Paxos group
I1117 22:11:43.096451 27830 recover.cpp:452] Recover process terminated
I1117 22:11:43.107835 27835 master.cpp:318] Master 20141117-221143-3176252227-47938-27806
(proserpina.apache.org) started on 67.195.81.189:47938
I1117 22:11:43.107884 27835 master.cpp:364] Master only allowing authenticated frameworks
to register
I1117 22:11:43.107903 27835 master.cpp:369] Master only allowing authenticated slaves to register
I1117 22:11:43.107934 27835 credentials.hpp:36] Loading credentials for authentication from
'/tmp/SlaveTest_MetricsInStatsEndpoint_Q9eHik/credentials'
I1117 22:11:43.108216 27835 master.cpp:413] Authorization enabled
I1117 22:11:43.108767 27824 master.cpp:126] No whitelist given. Advertising offers for all
slaves
I1117 22:11:43.108789 27829 hierarchical_allocator_process.hpp:299] Initializing hierarchical
allocator process with master : master@67.195.81.189:47938
I1117 22:11:43.110002 27835 master.cpp:1263] The newly elected leader is master@67.195.81.189:47938
with id 20141117-221143-3176252227-47938-27806
I1117 22:11:43.110033 27835 master.cpp:1276] Elected as the leading master!
I1117 22:11:43.110051 27835 master.cpp:1094] Recovering from registrar
I1117 22:11:43.110270 27823 registrar.cpp:313] Recovering registrar
I1117 22:11:43.110978 27831 log.cpp:656] Attempting to start the writer
I1117 22:11:43.112535 27830 replica.cpp:474] Replica received implicit promise request with
proposal 1
I1117 22:11:43.113276 27830 leveldb.cpp:306] Persisting metadata (8 bytes) to leveldb took
712062ns
I1117 22:11:43.113306 27830 replica.cpp:342] Persisted promised to 1
I1117 22:11:43.114028 27831 coordinator.cpp:230] Coordinator attemping to fill missing position
I1117 22:11:43.115814 27822 replica.cpp:375] Replica received explicit promise request for
position 0 with proposal 2
I1117 22:11:43.116592 27822 leveldb.cpp:343] Persisting action (8 bytes) to leveldb took 742164ns
I1117 22:11:43.116622 27822 replica.cpp:676] Persisted action at 0
I1117 22:11:43.118104 27823 replica.cpp:508] Replica received write request for position 0
I1117 22:11:43.118162 27823 leveldb.cpp:438] Reading position from leveldb took 30731ns
I1117 22:11:43.118892 27823 leveldb.cpp:343] Persisting action (14 bytes) to leveldb took
694158ns
I1117 22:11:43.118922 27823 replica.cpp:676] Persisted action at 0
I1117 22:11:43.119525 27821 replica.cpp:655] Replica received learned notice for position
0
I1117 22:11:43.120026 27821 leveldb.cpp:343] Persisting action (16 bytes) to leveldb took
471415ns
I1117 22:11:43.120074 27821 replica.cpp:676] Persisted action at 0
I1117 22:11:43.120100 27821 replica.cpp:661] Replica learned NOP action at position 0
I1117 22:11:43.120708 27826 log.cpp:672] Writer started with ending position 0
I1117 22:11:43.122165 27830 leveldb.cpp:438] Reading position from leveldb took 29241ns
I1117 22:11:43.125763 27833 registrar.cpp:346] Successfully fetched the registry (0B) in 15.423232ms
I1117 22:11:43.125881 27833 registrar.cpp:445] Applied 1 operations in 24896ns; attempting
to update the 'registry'
I1117 22:11:43.128851 27835 log.cpp:680] Attempting to append 143 bytes to the log
I1117 22:11:43.129104 27827 coordinator.cpp:340] Coordinator attempting to write APPEND action
at position 1
I1117 22:11:43.130313 27825 replica.cpp:508] Replica received write request for position 1
I1117 22:11:43.131099 27825 leveldb.cpp:343] Persisting action (162 bytes) to leveldb took
748093ns
I1117 22:11:43.131126 27825 replica.cpp:676] Persisted action at 1
I1117 22:11:43.131783 27828 replica.cpp:655] Replica received learned notice for position
1
I1117 22:11:43.132478 27828 leveldb.cpp:343] Persisting action (164 bytes) to leveldb took
667994ns
I1117 22:11:43.132508 27828 replica.cpp:676] Persisted action at 1
I1117 22:11:43.132534 27828 replica.cpp:661] Replica learned APPEND action at position 1
I1117 22:11:43.133651 27833 registrar.cpp:490] Successfully updated the 'registry' in 7.69792ms
I1117 22:11:43.133807 27833 registrar.cpp:376] Successfully recovered registrar
I1117 22:11:43.134114 27833 log.cpp:699] Attempting to truncate the log to 1
I1117 22:11:43.134148 27822 master.cpp:1121] Recovered 0 slaves from the Registry (105B) ;
allowing 10mins for slaves to re-register
I1117 22:11:43.134356 27825 coordinator.cpp:340] Coordinator attempting to write TRUNCATE
action at position 2
I1117 22:11:43.135193 27835 replica.cpp:508] Replica received write request for position 2
I1117 22:11:43.136000 27835 leveldb.cpp:343] Persisting action (16 bytes) to leveldb took
773694ns
I1117 22:11:43.155455 27835 replica.cpp:676] Persisted action at 2
I1117 22:11:43.156852 27835 replica.cpp:655] Replica received learned notice for position
2
I1117 22:11:43.157724 27835 leveldb.cpp:343] Persisting action (18 bytes) to leveldb took
843469ns
I1117 22:11:43.157790 27835 leveldb.cpp:401] Deleting ~1 keys from leveldb took 39568ns
I1117 22:11:43.157812 27835 replica.cpp:676] Persisted action at 2
I1117 22:11:43.157835 27835 replica.cpp:661] Replica learned TRUNCATE action at position 2
I1117 22:11:43.166299 27806 containerizer.cpp:101] Using isolation: posix/cpu,posix/mem
I1117 22:11:43.174968 27821 slave.cpp:172] Slave started on 62)@67.195.81.189:47938
I1117 22:11:43.175004 27821 credentials.hpp:84] Loading credential for authentication from
'/tmp/SlaveTest_MetricsInStatsEndpoint_iMBwjL/credential'
I1117 22:11:43.175173 27821 slave.cpp:281] Slave using credential for: test-principal
I1117 22:11:43.175426 27821 slave.cpp:294] Slave resources: cpus(*):2; mem(*):1024; disk(*):1024;
ports(*):[31000-32000]
I1117 22:11:43.175528 27821 slave.cpp:323] Slave hostname: proserpina.apache.org
I1117 22:11:43.175544 27821 slave.cpp:324] Slave checkpoint: false
W1117 22:11:43.175554 27821 slave.cpp:326] Disabling checkpointing is deprecated and the --checkpoint
flag will be removed in a future release. Please avoid using this flag
I1117 22:11:43.176422 27827 state.cpp:33] Recovering state from '/tmp/SlaveTest_MetricsInStatsEndpoint_iMBwjL/meta'
I1117 22:11:43.176482 27821 process.cpp:2881] Handling HTTP event for process 'slave(62)'
with path: '/slave(62)/stats.json'
I1117 22:11:43.176856 27821 http.cpp:255] HTTP request for '/slave(62)/stats.json'
I1117 22:11:43.177744 27828 process.cpp:2881] Handling HTTP event for process 'metrics' with
path: '/metrics/snapshot'
I1117 22:11:43.178325 27831 status_update_manager.cpp:197] Recovering status update manager
I1117 22:11:43.178585 27827 containerizer.cpp:282] Recovering containerizer
I1117 22:11:43.179657 27823 slave.cpp:3483] Finished recovery
I1117 22:11:43.180481 27825 slave.cpp:607] New master detected at master@67.195.81.189:47938
I1117 22:11:43.180506 27822 status_update_manager.cpp:171] Pausing sending status updates
I1117 22:11:43.180536 27825 slave.cpp:670] Authenticating with master master@67.195.81.189:47938
I1117 22:11:43.180552 27825 slave.cpp:675] Using default CRAM-MD5 authenticatee
I1117 22:11:43.180704 27825 slave.cpp:643] Detecting new master
I1117 22:11:43.180809 27820 authenticatee.hpp:138] Creating new client SASL connection
I1117 22:11:43.181180 27830 master.cpp:3896] Authenticating slave(62)@67.195.81.189:47938
I1117 22:11:43.181223 27830 master.cpp:3907] Using default CRAM-MD5 authenticator
I1117 22:11:43.181535 27829 authenticator.hpp:170] Creating new server SASL connection
I1117 22:11:43.181757 27832 authenticatee.hpp:229] Received SASL authentication mechanisms:
CRAM-MD5
I1117 22:11:43.181792 27832 authenticatee.hpp:255] Attempting to authenticate with mechanism
'CRAM-MD5'
I1117 22:11:43.181879 27832 authenticator.hpp:276] Received SASL authentication start
I1117 22:11:43.181937 27832 authenticator.hpp:398] Authentication requires more steps
I1117 22:11:43.182026 27823 authenticatee.hpp:275] Received SASL authentication step
I1117 22:11:43.182250 27824 authenticator.hpp:304] Received SASL authentication step
I1117 22:11:43.182287 27824 auxprop.cpp:99] Request to lookup properties for user: 'test-principal'
realm: 'proserpina.apache.org' server FQDN: 'proserpina.apache.org' SASL_AUXPROP_VERIFY_AGAINST_HASH:
false SASL_AUXPROP_OVERRIDE: false SASL_AUXPROP_AUTHZID: false 
I1117 22:11:43.182299 27824 auxprop.cpp:171] Looking up auxiliary property '*userPassword'
I1117 22:11:43.182337 27824 auxprop.cpp:171] Looking up auxiliary property '*cmusaslsecretCRAM-MD5'
I1117 22:11:43.182360 27824 auxprop.cpp:99] Request to lookup properties for user: 'test-principal'
realm: 'proserpina.apache.org' server FQDN: 'proserpina.apache.org' SASL_AUXPROP_VERIFY_AGAINST_HASH:
false SASL_AUXPROP_OVERRIDE: false SASL_AUXPROP_AUTHZID: true 
I1117 22:11:43.182374 27824 auxprop.cpp:121] Skipping auxiliary property '*userPassword' since
SASL_AUXPROP_AUTHZID == true
I1117 22:11:43.182382 27824 auxprop.cpp:121] Skipping auxiliary property '*cmusaslsecretCRAM-MD5'
since SASL_AUXPROP_AUTHZID == true
I1117 22:11:43.182401 27824 authenticator.hpp:390] Authentication success
I1117 22:11:43.182590 27827 authenticatee.hpp:315] Authentication success
I1117 22:11:43.182621 27835 master.cpp:3954] Successfully authenticated principal 'test-principal'
at slave(62)@67.195.81.189:47938
I1117 22:11:43.182893 27827 slave.cpp:741] Successfully authenticated with master master@67.195.81.189:47938
I1117 22:11:43.182998 27827 slave.cpp:1069] Will retry registration in 7.597119ms if necessary
I1117 22:11:43.183193 27835 master.cpp:3063] Registering slave at slave(62)@67.195.81.189:47938
(proserpina.apache.org) with id 20141117-221143-3176252227-47938-27806-S0
I1117 22:11:43.183656 27826 registrar.cpp:445] Applied 1 operations in 59822ns; attempting
to update the 'registry'
I1117 22:11:43.186889 27826 log.cpp:680] Attempting to append 324 bytes to the log
I1117 22:11:43.187018 27822 coordinator.cpp:340] Coordinator attempting to write APPEND action
at position 3
I1117 22:11:43.188148 27831 replica.cpp:508] Replica received write request for position 3
I1117 22:11:43.188902 27831 leveldb.cpp:343] Persisting action (343 bytes) to leveldb took
720764ns
I1117 22:11:43.188932 27831 replica.cpp:676] Persisted action at 3
I1117 22:11:43.189890 27825 replica.cpp:655] Replica received learned notice for position
3
I1117 22:11:43.190364 27825 leveldb.cpp:343] Persisting action (345 bytes) to leveldb took
444081ns
I1117 22:11:43.190392 27825 replica.cpp:676] Persisted action at 3
I1117 22:11:43.190412 27825 replica.cpp:661] Replica learned APPEND action at position 3
I1117 22:11:43.191601 27823 slave.cpp:1069] Will retry registration in 27.891042ms if necessary
I1117 22:11:43.191748 27834 registrar.cpp:490] Successfully updated the 'registry' in 7.945984ms
I1117 22:11:43.191776 27829 master.cpp:3051] Ignoring register slave message from slave(62)@67.195.81.189:47938
(proserpina.apache.org) as admission is already in progress
I1117 22:11:43.191999 27822 log.cpp:699] Attempting to truncate the log to 3
I1117 22:11:43.192206 27831 coordinator.cpp:340] Coordinator attempting to write TRUNCATE
action at position 4
I1117 22:11:43.192292 27832 slave.cpp:2555] Received ping from slave-observer(59)@67.195.81.189:47938
Mon Nov 17 22:40:21 UTC 2014: process still running after 1800 seconds
==========

Attaching gdb to 27649 bash ../support/timed_tests.sh GLOG_v=1 MESOS_VERBOSE=1 make check
GTEST_SHUFFLE=1 GTEST_OUTPUT=xml: 1800

==========
../support/timed_tests.sh: line 72: gdb: command not found
==========

Attaching gdb to 27652 bash ../support/timed_tests.sh GLOG_v=1 MESOS_VERBOSE=1 make check
GTEST_SHUFFLE=1 GTEST_OUTPUT=xml: 1800

==========
../support/timed_tests.sh: line 72: gdb: command not found
==========

Attaching gdb to 27654 make check GTEST_SHUFFLE=1 GTEST_OUTPUT=xml:

==========
../support/timed_tests.sh: line 72: gdb: command not found
==========

Attaching gdb to 27658 /bin/bash -c fail=; \ if (target_option=k; case ${target_option-} in
?) ;; *) echo "am__make_running_with_option: internal error: invalid" "target option '${target_option-}'
specified" >&2; exit 1;; esac; has_opt=no; sane_makeflags=$MAKEFLAGS; if test -n '
Makefile' && test -n '0'; then sane_makeflags=$MFLAGS; else case $MAKEFLAGS in *\\[\
\.]*) bs=\\; sane_makeflags=`printf '%s\n' "$MAKEFLAGS" | sed "s/$bs$bs[$bs $bs.]*//g"`;;
esac; fi; skip_next=no; strip_trailopt () { flg=`printf '%s\n' "$flg" | sed "s/$1.*$//"`;
}; for flg in $sane_makeflags; do test $skip_next = yes && { skip_next=no; continue;
}; case $flg in *=*|--*) continue;; -*I) strip_trailopt 'I'; skip_next=yes;; -*I?*) strip_trailopt
'I';; -*O) strip_trailopt 'O'; skip_next=yes;; -*O?*) strip_trailopt 'O';; -*l) strip_trailopt
'l'; skip_next=yes;; -*l?*) strip_trailopt 'l';; -[dEDm]) skip_next=yes;; -[JT]) skip_next=yes;;
esac; case $flg in *$target_option*) has_opt=yes; break;; esac; done; test $has_opt = yes);
then \   failcom='fail=yes'; \ else \   failcom='exit 1'; \ fi; \ dot_seen=no; \ target=`echo
check-recursive | sed s/-recursive//`; \ case "check-recursive" in \   distclean-* | maintainer-clean-*)
list='. 3rdparty src ec2' ;; \   *) list='. 3rdparty src ec2' ;; \ esac; \ for subdir in $list;
do \   echo "Making $target in $subdir"; \   if test "$subdir" = "."; then \     dot_seen=yes;
\     local_target="$target-am"; \   else \     local_target="$target"; \   fi; \   (CDPATH="${ZSH_VERSION+.}:"
&& cd $subdir && make  $local_target) \   || eval $failcom; \ done; \ if test
"$dot_seen" = "no"; then \   make  "$target-am" || exit 1; \ fi; test -z "$fail"

==========
../support/timed_tests.sh: line 72: gdb: command not found
==========

Attaching gdb to 27796 /bin/bash -c fail=; \ if (target_option=k; case ${target_option-} in
?) ;; *) echo "am__make_running_with_option: internal error: invalid" "target option '${target_option-}'
specified" >&2; exit 1;; esac; has_opt=no; sane_makeflags=$MAKEFLAGS; if test -n '
Makefile' && test -n '0'; then sane_makeflags=$MFLAGS; else case $MAKEFLAGS in *\\[\
\.]*) bs=\\; sane_makeflags=`printf '%s\n' "$MAKEFLAGS" | sed "s/$bs$bs[$bs $bs.]*//g"`;;
esac; fi; skip_next=no; strip_trailopt () { flg=`printf '%s\n' "$flg" | sed "s/$1.*$//"`;
}; for flg in $sane_makeflags; do test $skip_next = yes && { skip_next=no; continue;
}; case $flg in *=*|--*) continue;; -*I) strip_trailopt 'I'; skip_next=yes;; -*I?*) strip_trailopt
'I';; -*O) strip_trailopt 'O'; skip_next=yes;; -*O?*) strip_trailopt 'O';; -*l) strip_trailopt
'l'; skip_next=yes;; -*l?*) strip_trailopt 'l';; -[dEDm]) skip_next=yes;; -[JT]) skip_next=yes;;
esac; case $flg in *$target_option*) has_opt=yes; break;; esac; done; test $has_opt = yes);
then \   failcom='fail=yes'; \ else \   failcom='exit 1'; \ fi; \ dot_seen=no; \ target=`echo
check-recursive | sed s/-recursive//`; \ case "check-recursive" in \   distclean-* | maintainer-clean-*)
list='. 3rdparty src ec2' ;; \   *) list='. 3rdparty src ec2' ;; \ esac; \ for subdir in $list;
do \   echo "Making $target in $subdir"; \   if test "$subdir" = "."; then \     dot_seen=yes;
\     local_target="$target-am"; \   else \     local_target="$target"; \   fi; \   (CDPATH="${ZSH_VERSION+.}:"
&& cd $subdir && make  $local_target) \   || eval $failcom; \ done; \ if test
"$dot_seen" = "no"; then \   make  "$target-am" || exit 1; \ fi; test -z "$fail"

==========
../support/timed_tests.sh: line 72: gdb: command not found
==========

Attaching gdb to 27797 make check

==========
../support/timed_tests.sh: line 72: gdb: command not found
==========

Attaching gdb to 27798 make check-am

==========
../support/timed_tests.sh: line 72: gdb: command not found
==========

Attaching gdb to 27805 make check-local

==========
../support/timed_tests.sh: line 72: gdb: command not found
==========

Attaching gdb to 27806 <https://builds.apache.org/job/Mesos-Trunk-Ubuntu-Build-Out-Of-Src-Disable-Java-Disable-Python-Disable-Webui/ws/build/src/.libs/lt-mesos-tests>

==========
../support/timed_tests.sh: line 72: gdb: command not found
Test failed and killing the stuck test process
W1117 22:11:43.192292 27806 logging.cpp:81] RAW: Received signal SIGTERM from process 5738
of user 2395; exiting
make: *** [check-recursive] Terminated
/tmp/hudson5220796790177662966.sh: line 16: 27649 Terminated              ../support/timed_tests.sh
"GLOG_v=1 MESOS_VERBOSE=1 make check GTEST_SHUFFLE=1 GTEST_OUTPUT=xml:" 1800
make[3]: *** [check-local] Terminated
make[2]: *** [check-am] Terminated
make[1]: *** [check] Terminated
Build step 'Execute shell' marked build as failure
Recording test results

Mime
View raw message