mesos-dev mailing list archives

Site index · List index
Message view « Date » · « Thread »
Top « Date » · « Thread »
From Apache Jenkins Server <jenk...@builds.apache.org>
Subject Build failed in Jenkins: Mesos-Trunk-Ubuntu-Build-Out-Of-Src-Disable-Java-Disable-Python-Disable-Webui #2535
Date Fri, 07 Nov 2014 03:35:32 GMT
See <https://builds.apache.org/job/Mesos-Trunk-Ubuntu-Build-Out-Of-Src-Disable-Java-Disable-Python-Disable-Webui/2535/changes>

Changes:

[vinodkone] Updated scheduler driver to exponentially backoff during registration

------------------------------------------
[...truncated 65144 lines...]
I1107 03:34:44.615044 30026 slave.cpp:1798] Status update manager successfully handled status
update acknowledgement (UUID: beefce9a-5f3c-4fc1-bcd5-5954aaf1b6f3) for task 1 of framework
20141107-033439-3193029443-48289-29993-0000
I1107 03:34:44.615097 30026 slave.cpp:4258] Completing task 1
I1107 03:34:44.615115 30030 status_update_manager.cpp:371] Forwarding update TASK_FINISHED
(UUID: f0bad1d8-9aa6-4126-a8b8-2bbc4f08a0aa) for task 3 of framework 20141107-033439-3193029443-48289-29993-0000
to the slave
I1107 03:34:44.615272 30028 slave.cpp:2456] Forwarding the update TASK_FINISHED (UUID: f0bad1d8-9aa6-4126-a8b8-2bbc4f08a0aa)
for task 3 of framework 20141107-033439-3193029443-48289-29993-0000 to master@67.195.81.190:48289
I1107 03:34:44.615298 30017 slave.cpp:1798] Status update manager successfully handled status
update acknowledgement (UUID: 17a5f53a-0c16-4bab-b246-aa2d59e3772e) for task 4 of framework
20141107-033439-3193029443-48289-29993-0000
I1107 03:34:44.615352 30017 slave.cpp:4258] Completing task 4
I1107 03:34:44.615381 30028 slave.cpp:2383] Status update manager successfully handled status
update TASK_FINISHED (UUID: f0bad1d8-9aa6-4126-a8b8-2bbc4f08a0aa) for task 3 of framework
20141107-033439-3193029443-48289-29993-0000
I1107 03:34:44.615404 30028 slave.cpp:2389] Sending acknowledgement for status update TASK_FINISHED
(UUID: f0bad1d8-9aa6-4126-a8b8-2bbc4f08a0aa) for task 3 of framework 20141107-033439-3193029443-48289-29993-0000
to executor(1)@67.195.81.190:48983
I1107 03:34:44.615466 30023 master.cpp:3441] Forwarding status update TASK_FINISHED (UUID:
f0bad1d8-9aa6-4126-a8b8-2bbc4f08a0aa) for task 3 of framework 20141107-033439-3193029443-48289-29993-0000
I1107 03:34:44.615562 30023 master.cpp:3413] Status update TASK_FINISHED (UUID: f0bad1d8-9aa6-4126-a8b8-2bbc4f08a0aa)
for task 3 of framework 20141107-033439-3193029443-48289-29993-0000 from slave 20141107-033439-3193029443-48289-29993-S0
at slave(2)@67.195.81.190:48289 (pietas.apache.org)
I1107 03:34:44.615609 30023 master.cpp:4691] Updating the latest state of task 3 of framework
20141107-033439-3193029443-48289-29993-0000 to TASK_FINISHED
Task 3 is in state TASK_FINISHED
I1107 03:34:44.615715 30030 sched.cpp:669] Scheduler::statusUpdate took 40909ns
I1107 03:34:44.615792 30030 sched.cpp:779] Stopping framework '20141107-033439-3193029443-48289-29993-0000'
I1107 03:34:44.615818 30368 exec.cpp:339] Executor received status update acknowledgement
f0bad1d8-9aa6-4126-a8b8-2bbc4f08a0aa for task 3 of framework 20141107-033439-3193029443-48289-29993-0000
I1107 03:34:44.615849 30019 hierarchical_allocator_process.hpp:563] Recovered cpus(*):1; mem(*):128
(total allocatable: mem(*):10240; disk(*):3.70122e+06; ports(*):[31000-32000]; cpus(*):2)
on slave 20141107-033439-3193029443-48289-29993-S0 from framework 20141107-033439-3193029443-48289-29993-0000
I1107 03:34:44.615875 30023 master.cpp:4750] Removing task 3 with resources cpus(*):1; mem(*):128
of framework 20141107-033439-3193029443-48289-29993-0000 on slave 20141107-033439-3193029443-48289-29993-S0
at slave(2)@67.195.81.190:48289 (pietas.apache.org)
I1107 03:34:44.615988 30023 master.cpp:2913] Forwarding status update acknowledgement f0bad1d8-9aa6-4126-a8b8-2bbc4f08a0aa
for task 3 of framework 20141107-033439-3193029443-48289-29993-0000 (No Executor Framework
(C++)) at scheduler-4b61160a-cbba-45a8-a7d1-3d4971a8574f@67.195.81.190:48289 to slave 20141107-033439-3193029443-48289-29993-S0
at slave(2)@67.195.81.190:48289 (pietas.apache.org)
I1107 03:34:44.616142 30023 master.cpp:1702] Asked to unregister framework 20141107-033439-3193029443-48289-29993-0000
I1107 03:34:44.616168 30023 master.cpp:4269] Removing framework 20141107-033439-3193029443-48289-29993-0000
(No Executor Framework (C++)) at scheduler-4b61160a-cbba-45a8-a7d1-3d4971a8574f@67.195.81.190:48289
I1107 03:34:44.616230 30027 status_update_manager.cpp:389] Received status update acknowledgement
(UUID: f0bad1d8-9aa6-4126-a8b8-2bbc4f08a0aa) for task 3 of framework 20141107-033439-3193029443-48289-29993-0000
I1107 03:34:44.616335 30024 hierarchical_allocator_process.hpp:405] Deactivated framework
20141107-033439-3193029443-48289-29993-0000
I1107 03:34:44.616341 30027 status_update_manager.cpp:525] Cleaning up status update stream
for task 3 of framework 20141107-033439-3193029443-48289-29993-0000
I1107 03:34:44.616360 30026 slave.cpp:1531] Asked to shut down framework 20141107-033439-3193029443-48289-29993-0000
by master@67.195.81.190:48289
I1107 03:34:44.616392 30022 slave.cpp:1531] Asked to shut down framework 20141107-033439-3193029443-48289-29993-0000
by master@67.195.81.190:48289
I1107 03:34:44.616416 30026 slave.cpp:1556] Shutting down framework 20141107-033439-3193029443-48289-29993-0000
I1107 03:34:44.616461 30022 slave.cpp:1556] Shutting down framework 20141107-033439-3193029443-48289-29993-0000
I1107 03:34:44.616750 30026 slave.cpp:3144] Shutting down executor '4' of framework 20141107-033439-3193029443-48289-29993-0000
I1107 03:34:44.616750 30022 slave.cpp:3144] Shutting down executor '3' of framework 20141107-033439-3193029443-48289-29993-0000
I1107 03:34:44.616832 30023 master.cpp:693] Master terminating
I1107 03:34:44.616967 30024 hierarchical_allocator_process.hpp:360] Removed framework 20141107-033439-3193029443-48289-29993-0000
I1107 03:34:44.616369 30018 slave.cpp:1531] Asked to shut down framework 20141107-033439-3193029443-48289-29993-0000
by master@67.195.81.190:48289
I1107 03:34:44.617070 30018 slave.cpp:1556] Shutting down framework 20141107-033439-3193029443-48289-29993-0000
I1107 03:34:44.617180 30315 exec.cpp:379] Executor asked to shutdown
I1107 03:34:44.617172 30018 slave.cpp:3144] Shutting down executor '1' of framework 20141107-033439-3193029443-48289-29993-0000
I1107 03:34:44.617172 30022 slave.cpp:3144] Shutting down executor '2' of framework 20141107-033439-3193029443-48289-29993-0000
I1107 03:34:44.617318 30305 exec.cpp:78] Scheduling shutdown of the executor
I1107 03:34:44.617321 30315 exec.cpp:394] Executor::shutdown took 38094ns
I1107 03:34:44.617404 30018 slave.cpp:3144] Shutting down executor '0' of framework 20141107-033439-3193029443-48289-29993-0000
I1107 03:34:44.617516 30355 exec.cpp:379] Executor asked to shutdown
I1107 03:34:44.617636 30355 exec.cpp:394] Executor::shutdown took 10870ns
I1107 03:34:44.617651 30368 exec.cpp:78] Scheduling shutdown of the executor
I1107 03:34:44.617897 30324 exec.cpp:379] Executor asked to shutdown
I1107 03:34:44.618010 30345 exec.cpp:379] Executor asked to shutdown
I1107 03:34:44.618032 30324 exec.cpp:394] Executor::shutdown took 21435ns
I1107 03:34:44.618084 30345 exec.cpp:394] Executor::shutdown took 6993ns
I1107 03:34:44.618109 30345 exec.cpp:78] Scheduling shutdown of the executor
I1107 03:34:44.618105 30327 exec.cpp:78] Scheduling shutdown of the executor
I1107 03:34:44.618221 30306 exec.cpp:379] Executor asked to shutdown
I1107 03:34:44.618350 30306 exec.cpp:394] Executor::shutdown took 11869ns
I1107 03:34:44.618389 30022 slave.cpp:1798] Status update manager successfully handled status
update acknowledgement (UUID: f0bad1d8-9aa6-4126-a8b8-2bbc4f08a0aa) for task 3 of framework
20141107-033439-3193029443-48289-29993-0000
I1107 03:34:44.618454 30026 slave.cpp:2621] master@67.195.81.190:48289 exited
W1107 03:34:44.618484 30026 slave.cpp:2624] Master disconnected! Waiting for a new master
to be elected
I1107 03:34:44.618485 30022 slave.cpp:4258] Completing task 3
I1107 03:34:44.618494 30030 slave.cpp:2621] master@67.195.81.190:48289 exited
W1107 03:34:44.618522 30030 slave.cpp:2624] Master disconnected! Waiting for a new master
to be elected
I1107 03:34:44.618541 30306 exec.cpp:78] Scheduling shutdown of the executor
I1107 03:34:44.618562 30022 slave.cpp:2621] master@67.195.81.190:48289 exited
W1107 03:34:44.618585 30022 slave.cpp:2624] Master disconnected! Waiting for a new master
to be elected
I1107 03:34:44.623114 30028 slave.cpp:484] Slave terminating
I1107 03:34:44.623378 30028 slave.cpp:1531] Asked to shut down framework 20141107-033439-3193029443-48289-29993-0000
by @0.0.0.0:0
W1107 03:34:44.623409 30028 slave.cpp:1552] Ignoring shutdown framework 20141107-033439-3193029443-48289-29993-0000
because it is terminating
I1107 03:34:44.625808 29993 slave.cpp:484] Slave terminating
I1107 03:34:44.625897 29993 slave.cpp:1531] Asked to shut down framework 20141107-033439-3193029443-48289-29993-0000
by @0.0.0.0:0
W1107 03:34:44.625941 29993 slave.cpp:1552] Ignoring shutdown framework 20141107-033439-3193029443-48289-29993-0000
because it is terminating
I1107 03:34:44.627985 30022 slave.cpp:484] Slave terminating
I1107 03:34:44.628085 30022 slave.cpp:1531] Asked to shut down framework 20141107-033439-3193029443-48289-29993-0000
by @0.0.0.0:0
W1107 03:34:44.628132 30022 slave.cpp:1552] Ignoring shutdown framework 20141107-033439-3193029443-48289-29993-0000
because it is terminating
I1107 03:34:44.635607 30306 exec.cpp:440] Ignoring exited event because the driver is aborted!
I[       OK ] ExamplesTest.NoExecutorFramework (6696 ms)
1107 03:34:44.635651 30336 exec.cpp:440] Ignoring exited event because the driver is aborted!
[----------] 4 tests from ExamplesTest (29261 ms total)

[----------] 2 tests from ValuesTest
[ RUN      ] ValuesTest.ValidInput
I1107 03:34:44.635707 30367 exec.cpp:440] Ignoring exited event because the driver is aborted!
II1107 03:34:44.635756 30321 exec.cpp:440] Ignoring exited event because the driver is aborted!
1107 03:34:44.635756 30310 exec.cpp:440] Ignoring exited event because the driver is aborted!
[       OK ] ValuesTest.ValidInput (1 ms)
[ RUN      ] ValuesTest.InvalidInput
[       OK ] ValuesTest.InvalidInput (0 ms)
[----------] 2 tests from ValuesTest (1 ms total)

[----------] 1 test from MesosSchedulerDriverTest
[ RUN      ] MesosSchedulerDriverTest.MetricsEndpoint
Using temporary directory '/tmp/MesosSchedulerDriverTest_MetricsEndpoint_eYo8Vi'
I1107 03:34:44.641389 26054 leveldb.cpp:176] Opened db in 3.452521ms
I1107 03:34:44.642583 26054 leveldb.cpp:183] Compacted db in 1.119795ms
I1107 03:34:44.642642 26054 leveldb.cpp:198] Created db iterator in 19442ns
I1107 03:34:44.642663 26054 leveldb.cpp:204] Seeked to beginning of db in 1812ns
I1107 03:34:44.642673 26054 leveldb.cpp:273] Iterated through 0 keys in the db in 400ns
I1107 03:34:44.642715 26054 replica.cpp:741] Replica recovered with log positions 0 ->
0 with 1 holes and 0 unlearned
I1107 03:34:44.643728 26079 recover.cpp:437] Starting replica recovery
I1107 03:34:44.644064 26079 recover.cpp:463] Replica is in EMPTY status
I1107 03:34:44.645743 26083 replica.cpp:638] Replica in EMPTY status received a broadcasted
recover request
I1107 03:34:44.646198 26075 recover.cpp:188] Received a recover response from a replica in
EMPTY status
I1107 03:34:44.646706 26079 recover.cpp:554] Updating replica status to STARTING
I1107 03:34:44.647327 26073 master.cpp:318] Master 20141107-033444-3193029443-35410-26054
(pietas.apache.org) started on 67.195.81.190:35410
I1107 03:34:44.647385 26073 master.cpp:364] Master only allowing authenticated frameworks
to register
I1107 03:34:44.647413 26073 master.cpp:369] Master only allowing authenticated slaves to register
I1107 03:34:44.647564 26073 credentials.hpp:36] Loading credentials for authentication from
'/tmp/MesosSchedulerDriverTest_MetricsEndpoint_eYo8Vi/credentials'
I1107 03:34:44.647567 26077 leveldb.cpp:306] Persisting metadata (8 bytes) to leveldb took
537615ns
I1107 03:34:44.647635 26077 replica.cpp:320] Persisted replica status to STARTING
I1107 03:34:44.647893 26075 recover.cpp:463] Replica is in STARTING status
I1107 03:34:44.647908 26073 master.cpp:408] Authorization enabled
I1107 03:34:44.648555 26068 master.cpp:126] No whitelist given. Advertising offers for all
slaves
I1107 03:34:44.648601 26074 hierarchical_allocator_process.hpp:299] Initializing hierarchical
allocator process with master : master@67.195.81.190:35410
I1107 03:34:44.649284 26080 replica.cpp:638] Replica in STARTING status received a broadcasted
recover request
I1107 03:34:44.649729 26077 recover.cpp:188] Received a recover response from a replica in
STARTING status
I1107 03:34:44.650156 26072 master.cpp:1258] The newly elected leader is master@67.195.81.190:35410
with id 20141107-033444-3193029443-35410-26054
I1107 03:34:44.650166 26070 recover.cpp:554] Updating replica status to VOTING
I1107 03:34:44.650182 26072 master.cpp:1271] Elected as the leading master!
I1107 03:34:44.650194 26072 master.cpp:1089] Recovering from registrar
I1107 03:34:44.650475 26081 registrar.cpp:313] Recovering registrar
I1107 03:34:44.650601 26077 leveldb.cpp:306] Persisting metadata (8 bytes) to leveldb took
329757ns
I1107 03:34:44.650665 26077 replica.cpp:320] Persisted replica status to VOTING
I1107 03:34:44.650852 26078 recover.cpp:568] Successfully joined the Paxos group
I1107 03:34:44.651034 26078 recover.cpp:452] Recover process terminated
I1107 03:34:44.651355 26078 log.cpp:656] Attempting to start the writer
I1107 03:34:44.652374 26082 replica.cpp:474] Replica received implicit promise request with
proposal 1
I1107 03:34:44.652788 26082 leveldb.cpp:306] Persisting metadata (8 bytes) to leveldb took
390277ns
I1107 03:34:44.652809 26082 replica.cpp:342] Persisted promised to 1
I1107 03:34:44.653260 26081 coordinator.cpp:230] Coordinator attemping to fill missing position
I1107 03:34:44.654286 26073 replica.cpp:375] Replica received explicit promise request for
position 0 with proposal 2
I1107 03:34:44.654597 26073 leveldb.cpp:343] Persisting action (8 bytes) to leveldb took 281050ns
I1107 03:34:44.654619 26073 replica.cpp:676] Persisted action at 0
I1107 03:34:44.655557 26076 replica.cpp:508] Replica received write request for position 0
I1107 03:34:44.655604 26076 leveldb.cpp:438] Reading position from leveldb took 23058ns
I1107 03:34:44.655936 26076 leveldb.cpp:343] Persisting action (14 bytes) to leveldb took
303376ns
I1107 03:34:44.655958 26076 replica.cpp:676] Persisted action at 0
I1107 03:34:44.656378 26083 replica.cpp:655] Replica received learned notice for position
0
I1107 03:34:44.656729 26083 leveldb.cpp:343] Persisting action (16 bytes) to leveldb took
326277ns
I1107 03:34:44.656750 26083 replica.cpp:676] Persisted action at 0
I1107 03:34:44.656765 26083 replica.cpp:661] Replica learned NOP action at position 0
I1107 03:34:44.657213 26068 log.cpp:672] Writer started with ending position 0
I1107 03:34:44.658156 26081 leveldb.cpp:438] Reading position from leveldb took 26686ns
I1107 03:34:44.660310 26078 registrar.cpp:346] Successfully fetched the registry (0B) in 9.794048ms
I1107 03:34:44.660403 26078 registrar.cpp:445] Applied 1 operations in 14868ns; attempting
to update the 'registry'
I1107 03:34:44.663329 26070 log.cpp:680] Attempting to append 139 bytes to the log
I1107 03:34:44.663568 26079 coordinator.cpp:340] Coordinator attempting to write APPEND action
at position 1
I1107 03:34:44.664484 26079 replica.cpp:508] Replica received write request for position 1
I1107 03:34:44.665179 26079 leveldb.cpp:343] Persisting action (158 bytes) to leveldb took
659279ns
I1107 03:34:44.665212 26079 replica.cpp:676] Persisted action at 1
I1107 03:34:44.665935 26074 replica.cpp:655] Replica received learned notice for position
1
I1107 03:34:44.666513 26074 leveldb.cpp:343] Persisting action (160 bytes) to leveldb took
544779ns
I1107 03:34:44.666548 26074 replica.cpp:676] Persisted action at 1
I1107 03:34:44.666573 26074 replica.cpp:661] Replica learned APPEND action at position 1
I1107 03:34:44.667654 26069 registrar.cpp:490] Successfully updated the 'registry' in 7.062016ms
I1107 03:34:44.667793 26069 registrar.cpp:376] Successfully recovered registrar
I1107 03:34:44.667853 26074 log.cpp:699] Attempting to truncate the log to 1
I1107 03:34:44.668092 26083 coordinator.cpp:340] Coordinator attempting to write TRUNCATE
action at position 2
I1107 03:34:44.668114 26077 master.cpp:1116] Recovered 0 slaves from the Registry (101B) ;
allowing 10mins for slaves to re-register
I1107 03:34:44.669144 26068 replica.cpp:508] Replica received write request for position 2
I1107 03:34:44.669595 26068 leveldb.cpp:343] Persisting action (16 bytes) to leveldb took
414838ns
I1107 03:34:44.669622 26068 replica.cpp:676] Persisted action at 2
I1107 03:34:44.670280 26078 replica.cpp:655] Replica received learned notice for position
2
I1107 03:34:44.670696 26078 leveldb.cpp:343] Persisting action (18 bytes) to leveldb took
379192ns
I1107 03:34:44.670764 26078 leveldb.cpp:401] Deleting ~1 keys from leveldb took 39171ns
I1107 03:34:44.670789 26078 replica.cpp:676] Persisted action at 2
I1107 03:34:44.670811 26078 replica.cpp:661] Replica learned TRUNCATE action at position 2
I1107 03:34:44.682483 26054 sched.cpp:143] Version: 0.22.0
I1107 03:34:44.682957 26082 sched.cpp:239] New master detected at master@67.195.81.190:35410
I1107 03:34:44.683019 26082 sched.cpp:295] Authenticating with master master@67.195.81.190:35410
I1107 03:34:44.683352 26081 authenticatee.hpp:133] Creating new client SASL connection
I1107 03:34:44.683593 26073 master.cpp:3896] Authenticating scheduler-53b7dd3b-fa0e-431f-91c1-f13cf3a2fef8@67.195.81.190:35410
I1107 03:34:44.683647 26073 master.cpp:3907] Using default CRAM-MD5 authenticator
I1107 03:34:44.683923 26081 authenticator.hpp:169] Creating new server SASL connection
I1107 03:34:44.684131 26082 authenticatee.hpp:224] Received SASL authentication mechanisms:
CRAM-MD5
I1107 03:34:44.684173 26082 authenticatee.hpp:250] Attempting to authenticate with mechanism
'CRAM-MD5'
I1107 03:34:44.684314 26075 authenticator.hpp:275] Received SASL authentication start
I1107 03:34:44.684363 26075 authenticator.hpp:397] Authentication requires more steps
I1107 03:34:44.684461 26075 authenticatee.hpp:270] Received SASL authentication step
I1107 03:34:44.684597 26083 authenticator.hpp:303] Received SASL authentication step
I1107 03:34:44.684634 26083 auxprop.cpp:99] Request to lookup properties for user: 'test-principal'
realm: 'pietas.apache.org' server FQDN: 'pietas.apache.org' SASL_AUXPROP_VERIFY_AGAINST_HASH:
false SASL_AUXPROP_OVERRIDE: false SASL_AUXPROP_AUTHZID: false 
I1107 03:34:44.684656 26083 auxprop.cpp:171] Looking up auxiliary property '*userPassword'
I1107 03:34:44.684697 26083 auxprop.cpp:171] Looking up auxiliary property '*cmusaslsecretCRAM-MD5'
I1107 03:34:44.684732 26083 auxprop.cpp:99] Request to lookup properties for user: 'test-principal'
realm: 'pietas.apache.org' server FQDN: 'pietas.apache.org' SASL_AUXPROP_VERIFY_AGAINST_HASH:
false SASL_AUXPROP_OVERRIDE: false SASL_AUXPROP_AUTHZID: true 
I1107 03:34:44.684747 26083 auxprop.cpp:121] Skipping auxiliary property '*userPassword' since
SASL_AUXPROP_AUTHZID == true
I1107 03:34:44.684756 26083 auxprop.cpp:121] Skipping auxiliary property '*cmusaslsecretCRAM-MD5'
since SASL_AUXPROP_AUTHZID == true
I1107 03:34:44.684774 26083 authenticator.hpp:389] Authentication success
I1107 03:34:44.684861 26075 authenticatee.hpp:310] Authentication success
I1107 03:34:44.684898 26080 master.cpp:3957] Successfully authenticated principal 'test-principal'
at scheduler-53b7dd3b-fa0e-431f-91c1-f13cf3a2fef8@67.195.81.190:35410
I1107 03:34:44.685094 26075 sched.cpp:369] Successfully authenticated with master master@67.195.81.190:35410
I1107 03:34:44.685124 26075 sched.cpp:488] Sending registration request to master@67.195.81.190:35410
I1107 03:34:44.685168 26075 sched.cpp:521] Will retry registration in 15.566332ms if necessary
I1107 03:34:44.685242 26080 master.cpp:1378] Received registration request for framework 'default'
at scheduler-53b7dd3b-fa0e-431f-91c1-f13cf3a2fef8@67.195.81.190:35410
I1107 03:34:44.685307 26080 master.cpp:1337] Authorizing framework principal 'test-principal'
to receive offers for role '*'
I1107 03:34:44.685732 26077 master.cpp:1442] Registering framework 20141107-033444-3193029443-35410-26054-0000
(default) at scheduler-53b7dd3b-fa0e-431f-91c1-f13cf3a2fef8@67.195.81.190:35410
I1107 03:34:44.686015 26083 hierarchical_allocator_process.hpp:329] Added framework 20141107-033444-3193029443-35410-26054-0000
I1107 03:34:44.686045 26083 hierarchical_allocator_process.hpp:697] No resources available
to allocate!
I1107 03:34:44.686058 26083 hierarchical_allocator_process.hpp:659] Performed allocation for
0 slaves in 16919ns
I1107 03:34:44.686156 26073 sched.cpp:419] Framework registered with 20141107-033444-3193029443-35410-26054-0000
I1107 03:34:44.686229 26073 sched.cpp:433] Scheduler::registered took 46349ns
I1107 03:34:44.686820 26069 process.cpp:3358] Handling HTTP event for process 'metrics' with
path: '/metrics//snapshot'
I1107 03:34:44.697871 26054 master.cpp:693] Master terminating
I1107 03:34:44.697913 26082 sched.cpp:779] Stopping framework '20141107-033444-3193029443-35410-26054-0000'
[       OK ] MesosSchedulerDriverTest.MetricsEndpoint (67 ms)
[----------] 1 test from MesosSchedulerDriverTest (67 ms total)

[----------] Global test environment tear-down
[==========] 415 tests from 64 test cases ran. (353511 ms total)
[  PASSED  ] 414 tests.
[  FAILED  ] 1 test, listed below:
[  FAILED  ] MesosContainerizerExecuteTest.IoRedirection

 1 FAILED TEST
  YOU HAVE 5 DISABLED TESTS

make[3]: *** [check-local] Error 1
make[3]: Leaving directory `<https://builds.apache.org/job/Mesos-Trunk-Ubuntu-Build-Out-Of-Src-Disable-Java-Disable-Python-Disable-Webui/ws/build/src'>
make[2]: *** [check-am] Error 2
make[2]: Leaving directory `<https://builds.apache.org/job/Mesos-Trunk-Ubuntu-Build-Out-Of-Src-Disable-Java-Disable-Python-Disable-Webui/ws/build/src'>
make[1]: *** [check] Error 2
make[1]: Leaving directory `<https://builds.apache.org/job/Mesos-Trunk-Ubuntu-Build-Out-Of-Src-Disable-Java-Disable-Python-Disable-Webui/ws/build/src'>
make: *** [check-recursive] Error 1
Shutting down
Sending SIGTERM to process tree at pid 30371
Shutting down
Sending SIGTERM to process tree at pid 30370
Shutting down
Sending SIGTERM to process tree at pid 30372
Shutting down
Sending SIGTERM to process tree at pid 30373
Shutting down
Sending SIGTERM to process tree at pid 30374
Killing the following process trees:
[ 

]
Killing the following process trees:
[ 

]
Killing the following process trees:
[ 

]
Killing the following process trees:
[ 

]
Killing the following process trees:
[ 

]
Test finished
Exit status: 2
Build step 'Execute shell' marked build as failure
Recording test results

Mime
View raw message