mesos-dev mailing list archives

Site index · List index
Message view « Date » · « Thread »
Top « Date » · « Thread »
From Apache Jenkins Server <jenk...@builds.apache.org>
Subject Build failed in Jenkins: Mesos-Trunk-Ubuntu-Build-In-Src-Set-JAVA_HOME #2255
Date Thu, 06 Nov 2014 21:53:34 GMT
See <https://builds.apache.org/job/Mesos-Trunk-Ubuntu-Build-In-Src-Set-JAVA_HOME/2255/changes>

Changes:

[idownes] Updated docs/configuration.md.

------------------------------------------
[...truncated 65481 lines...]
I1106 21:52:48.399585 26726 master.cpp:3907] Using default CRAM-MD5 authenticator
I1106 21:52:48.399814 26735 authenticator.hpp:169] Creating new server SASL connection
I1106 21:52:48.399960 26730 authenticatee.hpp:224] Received SASL authentication mechanisms:
CRAM-MD5
I1106 21:52:48.399986 26730 authenticatee.hpp:250] Attempting to authenticate with mechanism
'CRAM-MD5'
I1106 21:52:48.400079 26730 authenticator.hpp:275] Received SASL authentication start
I1106 21:52:48.400126 26730 authenticator.hpp:397] Authentication requires more steps
I1106 21:52:48.400244 26729 authenticatee.hpp:270] Received SASL authentication step
I1106 21:52:48.400329 26729 authenticator.hpp:303] Received SASL authentication step
I1106 21:52:48.400352 26729 auxprop.cpp:99] Request to lookup properties for user: 'test-principal'
realm: 'proserpina.apache.org' server FQDN: 'proserpina.apache.org' SASL_AUXPROP_VERIFY_AGAINST_HASH:
false SASL_AUXPROP_OVERRIDE: false SASL_AUXPROP_AUTHZID: false 
I1106 21:52:48.400362 26729 auxprop.cpp:171] Looking up auxiliary property '*userPassword'
I1106 21:52:48.400395 26729 auxprop.cpp:171] Looking up auxiliary property '*cmusaslsecretCRAM-MD5'
I1106 21:52:48.400413 26729 auxprop.cpp:99] Request to lookup properties for user: 'test-principal'
realm: 'proserpina.apache.org' server FQDN: 'proserpina.apache.org' SASL_AUXPROP_VERIFY_AGAINST_HASH:
false SASL_AUXPROP_OVERRIDE: false SASL_AUXPROP_AUTHZID: true 
I1106 21:52:48.400420 26729 auxprop.cpp:121] Skipping auxiliary property '*userPassword' since
SASL_AUXPROP_AUTHZID == true
I1106 21:52:48.400426 26729 auxprop.cpp:121] Skipping auxiliary property '*cmusaslsecretCRAM-MD5'
since SASL_AUXPROP_AUTHZID == true
I1106 21:52:48.400437 26729 authenticator.hpp:389] Authentication success
I1106 21:52:48.400516 26734 authenticatee.hpp:310] Authentication success
I1106 21:52:48.400591 26736 master.cpp:3957] Successfully authenticated principal 'test-principal'
at scheduler-cb0abfc3-17a9-4471-b54a-8528a79e5279@67.195.81.189:56794
I1106 21:52:48.400902 26728 sched.cpp:357] Successfully authenticated with master master@67.195.81.189:56794
I1106 21:52:48.400949 26728 sched.cpp:476] Sending registration request to master@67.195.81.189:56794
I1106 21:52:48.401149 26736 master.cpp:1378] Received registration request for framework 'default'
at scheduler-cb0abfc3-17a9-4471-b54a-8528a79e5279@67.195.81.189:56794
I1106 21:52:48.401211 26736 master.cpp:1337] Authorizing framework principal 'test-principal'
to receive offers for role '*'
I1106 21:52:48.401655 26737 master.cpp:1442] Registering framework 20141106-215248-3176252227-56794-26710-0000
(default) at scheduler-cb0abfc3-17a9-4471-b54a-8528a79e5279@67.195.81.189:56794
I1106 21:52:48.401954 26727 hierarchical_allocator_process.hpp:329] Added framework 20141106-215248-3176252227-56794-26710-0000
I1106 21:52:48.401974 26727 hierarchical_allocator_process.hpp:697] No resources available
to allocate!
I1106 21:52:48.401985 26727 hierarchical_allocator_process.hpp:659] Performed allocation for
0 slaves in 13303ns
I1106 21:52:48.402000 26737 sched.cpp:407] Framework registered with 20141106-215248-3176252227-56794-26710-0000
I1106 21:52:48.402042 26737 sched.cpp:421] Scheduler::registered took 16407ns
I1106 21:52:48.402606 26730 master.cpp:784] Framework 20141106-215248-3176252227-56794-26710-0000
(default) at scheduler-cb0abfc3-17a9-4471-b54a-8528a79e5279@67.195.81.189:56794 disconnected
I1106 21:52:48.402632 26730 master.cpp:1747] Disconnecting framework 20141106-215248-3176252227-56794-26710-0000
(default) at scheduler-cb0abfc3-17a9-4471-b54a-8528a79e5279@67.195.81.189:56794
I1106 21:52:48.402660 26730 master.cpp:1763] Deactivating framework 20141106-215248-3176252227-56794-26710-0000
(default) at scheduler-cb0abfc3-17a9-4471-b54a-8528a79e5279@67.195.81.189:56794
I1106 21:52:48.402724 26730 master.cpp:806] Giving framework 20141106-215248-3176252227-56794-26710-0000
(default) at scheduler-cb0abfc3-17a9-4471-b54a-8528a79e5279@67.195.81.189:56794 0ns to failover
I1106 21:52:48.403165 26739 hierarchical_allocator_process.hpp:405] Deactivated framework
20141106-215248-3176252227-56794-26710-0000
I1106 21:52:48.403228 26727 master.cpp:3708] Framework failover timeout, removing framework
20141106-215248-3176252227-56794-26710-0000 (default) at scheduler-cb0abfc3-17a9-4471-b54a-8528a79e5279@67.195.81.189:56794
I1106 21:52:48.403256 26727 master.cpp:4269] Removing framework 20141106-215248-3176252227-56794-26710-0000
(default) at scheduler-cb0abfc3-17a9-4471-b54a-8528a79e5279@67.195.81.189:56794
I1106 21:52:48.403633 26725 hierarchical_allocator_process.hpp:360] Removed framework 20141106-215248-3176252227-56794-26710-0000
2014-11-06 21:52:48,421:26710(0x2b86450ef700):ZOO_ERROR@handle_socket_error_msg@1697: Socket
[127.0.0.1:56188] zk retcode=-4, errno=111(Connection refused): server refused to accept the
client
I1106 21:52:48.428316 26710 sched.cpp:137] Version: 0.22.0
I1106 21:52:48.428788 26734 sched.cpp:233] New master detected at master@67.195.81.189:56794
I1106 21:52:48.428833 26734 sched.cpp:283] Authenticating with master master@67.195.81.189:56794
I1106 21:52:48.429121 26732 authenticatee.hpp:133] Creating new client SASL connection
I1106 21:52:48.429321 26725 master.cpp:3896] Authenticating scheduler-ea716781-df70-4369-9c3a-f36f03458ab8@67.195.81.189:56794
I1106 21:52:48.429354 26725 master.cpp:3907] Using default CRAM-MD5 authenticator
I1106 21:52:48.429612 26727 authenticator.hpp:169] Creating new server SASL connection
I1106 21:52:48.429774 26730 authenticatee.hpp:224] Received SASL authentication mechanisms:
CRAM-MD5
I1106 21:52:48.429800 26730 authenticatee.hpp:250] Attempting to authenticate with mechanism
'CRAM-MD5'
I1106 21:52:48.429939 26724 authenticator.hpp:275] Received SASL authentication start
I1106 21:52:48.430022 26724 authenticator.hpp:397] Authentication requires more steps
I1106 21:52:48.430112 26724 authenticatee.hpp:270] Received SASL authentication step
I1106 21:52:48.430186 26724 authenticator.hpp:303] Received SASL authentication step
I1106 21:52:48.430205 26724 auxprop.cpp:99] Request to lookup properties for user: 'test-principal'
realm: 'proserpina.apache.org' server FQDN: 'proserpina.apache.org' SASL_AUXPROP_VERIFY_AGAINST_HASH:
false SASL_AUXPROP_OVERRIDE: false SASL_AUXPROP_AUTHZID: false 
I1106 21:52:48.430214 26724 auxprop.cpp:171] Looking up auxiliary property '*userPassword'
I1106 21:52:48.430240 26724 auxprop.cpp:171] Looking up auxiliary property '*cmusaslsecretCRAM-MD5'
I1106 21:52:48.430256 26724 auxprop.cpp:99] Request to lookup properties for user: 'test-principal'
realm: 'proserpina.apache.org' server FQDN: 'proserpina.apache.org' SASL_AUXPROP_VERIFY_AGAINST_HASH:
false SASL_AUXPROP_OVERRIDE: false SASL_AUXPROP_AUTHZID: true 
I1106 21:52:48.430264 26724 auxprop.cpp:121] Skipping auxiliary property '*userPassword' since
SASL_AUXPROP_AUTHZID == true
I1106 21:52:48.430270 26724 auxprop.cpp:121] Skipping auxiliary property '*cmusaslsecretCRAM-MD5'
since SASL_AUXPROP_AUTHZID == true
I1106 21:52:48.430282 26724 authenticator.hpp:389] Authentication success
I1106 21:52:48.430371 26724 authenticatee.hpp:310] Authentication success
I1106 21:52:48.430423 26729 master.cpp:3957] Successfully authenticated principal 'test-principal'
at scheduler-ea716781-df70-4369-9c3a-f36f03458ab8@67.195.81.189:56794
I1106 21:52:48.430671 26732 sched.cpp:357] Successfully authenticated with master master@67.195.81.189:56794
I1106 21:52:48.430693 26732 sched.cpp:476] Sending registration request to master@67.195.81.189:56794
W1106 21:52:48.430850 26732 master.cpp:1506] Completed framework 20141106-215248-3176252227-56794-26710-0000
(default) at scheduler-cb0abfc3-17a9-4471-b54a-8528a79e5279@67.195.81.189:56794 attempted
to re-register
I1106 21:52:48.430930 26732 sched.cpp:729] Got error 'Completed framework attempted to re-register'
I1106 21:52:48.430982 26732 sched.cpp:740] Scheduler::error took 20601ns
I1106 21:52:48.431027 26732 sched.cpp:770] Aborting framework '20141106-215248-3176252227-56794-26710-0000'
I1106 21:52:48.431040 26732 sched.cpp:775] Not sending a deactivate message as master is disconnected
I1106 21:52:48.438560 26710 master.cpp:693] Master terminating
I1106 21:52:48.438629 26727 sched.cpp:745] Stopping framework '20141106-215248-3176252227-56794-26710-0000'
I1106 21:52:48.438776 26735 sched.cpp:745] Stopping framework '20141106-215248-3176252227-56794-26710-0000'
[       OK ] FaultToleranceTest.SchedulerReregisterAfterFailoverTimeout (94 ms)
[ RUN      ] FaultToleranceTest.ReregisterFrameworkExitedExecutor
Using temporary directory '/tmp/FaultToleranceTest_ReregisterFrameworkExitedExecutor_lwm9gF'
I1106 21:52:48.449009 26710 leveldb.cpp:176] Opened db in 2.664238ms
I1106 21:52:48.449996 26710 leveldb.cpp:183] Compacted db in 959848ns
I1106 21:52:48.450031 26710 leveldb.cpp:198] Created db iterator in 4607ns
I1106 21:52:48.450070 26710 leveldb.cpp:204] Seeked to beginning of db in 720ns
I1106 21:52:48.450083 26710 leveldb.cpp:273] Iterated through 0 keys in the db in 260ns
I1106 21:52:48.450114 26710 replica.cpp:741] Replica recovered with log positions 0 ->
0 with 1 holes and 0 unlearned
I1106 21:52:48.450659 26733 recover.cpp:437] Starting replica recovery
I1106 21:52:48.450896 26733 recover.cpp:463] Replica is in EMPTY status
I1106 21:52:48.452160 26732 replica.cpp:638] Replica in EMPTY status received a broadcasted
recover request
I1106 21:52:48.452633 26739 recover.cpp:188] Received a recover response from a replica in
EMPTY status
I1106 21:52:48.453225 26726 recover.cpp:554] Updating replica status to STARTING
I1106 21:52:48.454219 26731 leveldb.cpp:306] Persisting metadata (8 bytes) to leveldb took
803713ns
I1106 21:52:48.454244 26731 replica.cpp:320] Persisted replica status to STARTING
I1106 21:52:48.454283 26724 master.cpp:318] Master 20141106-215248-3176252227-56794-26710
(proserpina.apache.org) started on 67.195.81.189:56794
I1106 21:52:48.454325 26724 master.cpp:364] Master only allowing authenticated frameworks
to register
I1106 21:52:48.454334 26724 master.cpp:369] Master only allowing authenticated slaves to register
I1106 21:52:48.454355 26724 credentials.hpp:36] Loading credentials for authentication from
'/tmp/FaultToleranceTest_ReregisterFrameworkExitedExecutor_lwm9gF/credentials'
I1106 21:52:48.454499 26731 recover.cpp:463] Replica is in STARTING status
I1106 21:52:48.454589 26724 master.cpp:408] Authorization enabled
I1106 21:52:48.454995 26738 master.cpp:126] No whitelist given. Advertising offers for all
slaves
I1106 21:52:48.455162 26726 hierarchical_allocator_process.hpp:299] Initializing hierarchical
allocator process with master : master@67.195.81.189:56794
I1106 21:52:48.455459 26735 replica.cpp:638] Replica in STARTING status received a broadcasted
recover request
I1106 21:52:48.455937 26738 recover.cpp:188] Received a recover response from a replica in
STARTING status
I1106 21:52:48.456388 26736 master.cpp:1258] The newly elected leader is master@67.195.81.189:56794
with id 20141106-215248-3176252227-56794-26710
I1106 21:52:48.456423 26736 master.cpp:1271] Elected as the leading master!
I1106 21:52:48.456439 26736 master.cpp:1089] Recovering from registrar
I1106 21:52:48.456471 26731 recover.cpp:554] Updating replica status to VOTING
I1106 21:52:48.456563 26734 registrar.cpp:313] Recovering registrar
I1106 21:52:48.457078 26738 leveldb.cpp:306] Persisting metadata (8 bytes) to leveldb took
443931ns
I1106 21:52:48.457105 26738 replica.cpp:320] Persisted replica status to VOTING
I1106 21:52:48.457262 26727 recover.cpp:568] Successfully joined the Paxos group
I1106 21:52:48.457456 26727 recover.cpp:452] Recover process terminated
I1106 21:52:48.457926 26732 log.cpp:656] Attempting to start the writer
I1106 21:52:48.459302 26732 replica.cpp:474] Replica received implicit promise request with
proposal 1
I1106 21:52:48.459811 26732 leveldb.cpp:306] Persisting metadata (8 bytes) to leveldb took
483970ns
I1106 21:52:48.459833 26732 replica.cpp:342] Persisted promised to 1
I1106 21:52:48.460522 26736 coordinator.cpp:230] Coordinator attemping to fill missing position
I1106 21:52:48.462172 26727 replica.cpp:375] Replica received explicit promise request for
position 0 with proposal 2
I1106 21:52:48.462769 26727 leveldb.cpp:343] Persisting action (8 bytes) to leveldb took 560676ns
I1106 21:52:48.462800 26727 replica.cpp:676] Persisted action at 0
I1106 21:52:48.464258 26731 replica.cpp:508] Replica received write request for position 0
I1106 21:52:48.464304 26731 leveldb.cpp:438] Reading position from leveldb took 23970ns
I1106 21:52:48.464853 26731 leveldb.cpp:343] Persisting action (14 bytes) to leveldb took
516701ns
I1106 21:52:48.464876 26731 replica.cpp:676] Persisted action at 0
I1106 21:52:48.465571 26729 replica.cpp:655] Replica received learned notice for position
0
I1106 21:52:48.466208 26729 leveldb.cpp:343] Persisting action (16 bytes) to leveldb took
612922ns
I1106 21:52:48.466233 26729 replica.cpp:676] Persisted action at 0
I1106 21:52:48.466253 26729 replica.cpp:661] Replica learned NOP action at position 0
I1106 21:52:48.466792 26735 log.cpp:672] Writer started with ending position 0
I1106 21:52:48.468428 26729 leveldb.cpp:438] Reading position from leveldb took 19861ns
I1106 21:52:48.470935 26733 registrar.cpp:346] Successfully fetched the registry (0B) in 14.322944ms
I1106 21:52:48.471048 26733 registrar.cpp:445] Applied 1 operations in 19347ns; attempting
to update the 'registry'
I1106 21:52:48.473989 26727 log.cpp:680] Attempting to append 143 bytes to the log
I1106 21:52:48.474210 26735 coordinator.cpp:340] Coordinator attempting to write APPEND action
at position 1
I1106 21:52:48.475105 26731 replica.cpp:508] Replica received write request for position 1
I1106 21:52:48.475682 26731 leveldb.cpp:343] Persisting action (162 bytes) to leveldb took
551330ns
I1106 21:52:48.475704 26731 replica.cpp:676] Persisted action at 1
I1106 21:52:48.476439 26727 replica.cpp:655] Replica received learned notice for position
1
I1106 21:52:48.477195 26727 leveldb.cpp:343] Persisting action (164 bytes) to leveldb took
726534ns
I1106 21:52:48.477226 26727 replica.cpp:676] Persisted action at 1
I1106 21:52:48.477249 26727 replica.cpp:661] Replica learned APPEND action at position 1
I1106 21:52:48.478310 26729 registrar.cpp:490] Successfully updated the 'registry' in 7.193088ms
I1106 21:52:48.478459 26729 registrar.cpp:376] Successfully recovered registrar
I1106 21:52:48.478552 26725 log.cpp:699] Attempting to truncate the log to 1
I1106 21:52:48.478766 26729 coordinator.cpp:340] Coordinator attempting to write TRUNCATE
action at position 2
I1106 21:52:48.478799 26738 master.cpp:1116] Recovered 0 slaves from the Registry (105B) ;
allowing 10mins for slaves to re-register
I1106 21:52:48.479715 26733 replica.cpp:508] Replica received write request for position 2
I1106 21:52:48.480423 26733 leveldb.cpp:343] Persisting action (16 bytes) to leveldb took
675454ns
I1106 21:52:48.480454 26733 replica.cpp:676] Persisted action at 2
I1106 21:52:48.481221 26731 replica.cpp:655] Replica received learned notice for position
2
I1106 21:52:48.481806 26731 leveldb.cpp:343] Persisting action (18 bytes) to leveldb took
556513ns
I1106 21:52:48.481860 26731 leveldb.cpp:401] Deleting ~1 keys from leveldb took 24931ns
I1106 21:52:48.481884 26731 replica.cpp:676] Persisted action at 2
I1106 21:52:48.481905 26731 replica.cpp:661] Replica learned TRUNCATE action at position 2
I1106 21:52:48.494312 26727 slave.cpp:169] Slave started on 206)@67.195.81.189:56794
I1106 21:52:48.494354 26727 credentials.hpp:84] Loading credential for authentication from
'/tmp/FaultToleranceTest_ReregisterFrameworkExitedExecutor_FhJAEP/credential'
I1106 21:52:48.494535 26727 slave.cpp:276] Slave using credential for: test-principal
I1106 21:52:48.494914 26727 slave.cpp:289] Slave resources: cpus(*):2; mem(*):1024; disk(*):1024;
ports(*):[31000-32000]
I1106 21:52:48.495030 26727 slave.cpp:318] Slave hostname: proserpina.apache.org
I1106 21:52:48.495096 26727 slave.cpp:319] Slave checkpoint: false
W1106 21:52:48.495117 26727 slave.cpp:321] Disabling checkpointing is deprecated and the --checkpoint
flag will be removed in a future release. Please avoid using this flag
I1106 21:52:48.496136 26737 state.cpp:33] Recovering state from '/tmp/FaultToleranceTest_ReregisterFrameworkExitedExecutor_FhJAEP/meta'
I1106 21:52:48.496449 26725 status_update_manager.cpp:197] Recovering status update manager
I1106 21:52:48.496860 26725 slave.cpp:3466] Finished recovery
I1106 21:52:48.497419 26725 slave.cpp:602] New master detected at master@67.195.81.189:56794
I1106 21:52:48.497424 26724 status_update_manager.cpp:171] Pausing sending status updates
I1106 21:52:48.497495 26725 slave.cpp:665] Authenticating with master master@67.195.81.189:56794
I1106 21:52:48.497624 26725 slave.cpp:638] Detecting new master
I1106 21:52:48.497684 26729 authenticatee.hpp:133] Creating new client SASL connection
I1106 21:52:48.500072 26710 sched.cpp:137] Version: 0.22.0
I1106 21:52:49.144429 26729 master.cpp:3896] Authenticating slave(206)@67.195.81.189:56794
I1106 21:52:49.144495 26729 master.cpp:3907] Using default CRAM-MD5 authenticator
I1106 21:52:49.144717 26737 authenticator.hpp:169] Creating new server SASL connection
I1106 21:52:49.144793 26730 sched.cpp:233] New master detected at master@67.195.81.189:56794
I1106 21:52:49.144832 26730 sched.cpp:283] Authenticating with master master@67.195.81.189:56794
I1106 21:52:49.144901 26732 authenticatee.hpp:224] Received SASL authentication mechanisms:
CRAM-MD5
I1106 21:52:49.144929 26732 authenticatee.hpp:250] Attempting to authenticate with mechanism
'CRAM-MD5'
I1106 21:52:49.145017 26724 authenticator.hpp:275] Received SASL authentication start
I1106 21:52:49.145081 26733 authenticatee.hpp:133] Creating new client SASL connection
I1106 21:52:49.145119 26724 authenticator.hpp:397] Authentication requires more steps
I1106 21:52:49.145207 26733 authenticatee.hpp:270] Received SASL authentication step
I1106 21:52:49.145304 26732 authenticator.hpp:303] Received SASL authentication step
I1106 21:52:49.145305 26727 master.cpp:3896] Authenticating scheduler-5b460b2b-88e2-4c5a-8151-9f1ace26c8a2@67.195.81.189:56794
I1106 21:52:49.145337 26732 auxprop.cpp:99] Request to lookup properties for user: 'test-principal'
realm: 'proserpina.apache.org' server FQDN: 'proserpina.apache.org' SASL_AUXPROP_VERIFY_AGAINST_HASH:
false SASL_AUXPROP_OVERRIDE: false SASL_AUXPROP_AUTHZID: false 
I1106 21:52:49.145349 26727 master.cpp:3907] Using default CRAM-MD5 authenticator
I1106 21:52:49.145354 26732 auxprop.cpp:171] Looking up auxiliary property '*userPassword'
*** Aborted at 1415310769 (unix time) try "date -d @1415310769" if you are using GNU date
***
I1106 21:52:49.145493 26733 authenticator.hpp:169] Creating new server SASL connection
I1106 21:52:49.145612 26729 authenticatee.hpp:224] Received SASL authentication mechanisms:
CRAM-MD5
I1106 21:52:49.145633 26729 authenticatee.hpp:250] Attempting to authenticate with mechanism
'CRAM-MD5'
PC: @     0x2b82b51c15c8 (unknown)
I1106 21:52:49.145705 26729 authenticator.hpp:275] Received SASL authentication start
I1106 21:52:49.145740 26729 authenticator.hpp:397] Authentication requires more steps
I1106 21:52:49.145810 26729 authenticatee.hpp:270] Received SASL authentication step
*** SIGSEGV (@0x10) received by PID 26710 (TID 0x2b82b88ce700) from PID 16; stack trace: ***
I1106 21:52:49.145891 26729 authenticator.hpp:303] Received SASL authentication step
I1106 21:52:49.145911 26729 auxprop.cpp:99] Request to lookup properties for user: 'test-principal'
realm: 'proserpina.apache.org' server FQDN: 'proserpina.apache.org' SASL_AUXPROP_VERIFY_AGAINST_HASH:
false SASL_AUXPROP_OVERRIDE: false SASL_AUXPROP_AUTHZID: false 
I1106 21:52:49.145920 26729 auxprop.cpp:171] Looking up auxiliary property '*userPassword'
I1106 21:52:49.145949 26729 auxprop.cpp:171] Looking up auxiliary property '*cmusaslsecretCRAM-MD5'
I1106 21:52:49.145967 26729 auxprop.cpp:99] Request to lookup properties for user: 'test-principal'
realm: 'proserpina.apache.org' server FQDN: 'proserpina.apache.org' SASL_AUXPROP_VERIFY_AGAINST_HASH:
false SASL_AUXPROP_OVERRIDE: false SASL_AUXPROP_AUTHZID: true 
I1106 21:52:49.145974 26729 auxprop.cpp:121] Skipping auxiliary property '*userPassword' since
SASL_AUXPROP_AUTHZID == true
I1106 21:52:49.145980 26729 auxprop.cpp:121] Skipping auxiliary property '*cmusaslsecretCRAM-MD5'
since SASL_AUXPROP_AUTHZID == true
I1106 21:52:49.145993 26729 authenticator.hpp:389] Authentication success
I1106 21:52:49.146093 26731 authenticatee.hpp:310] Authentication success
I1106 21:52:49.146101 26726 master.cpp:3957] Successfully authenticated principal 'test-principal'
at scheduler-5b460b2b-88e2-4c5a-8151-9f1ace26c8a2@67.195.81.189:56794
I1106 21:52:49.146359 26736 sched.cpp:357] Successfully authenticated with master master@67.195.81.189:56794
I1106 21:52:49.146378 26736 sched.cpp:476] Sending registration request to master@67.195.81.189:56794
I1106 21:52:49.146514 26735 master.cpp:1378] Received registration request for framework 'default'
at scheduler-5b460b2b-88e2-4c5a-8151-9f1ace26c8a2@67.195.81.189:56794
    @     0x2b83045db85a call_chained_handler()
I1106 21:52:49.146577 26735 master.cpp:1337] Authorizing framework principal 'test-principal'
to receive offers for role '*'
I1106 21:52:49.146946 26735 master.cpp:1442] Registering framework 20141106-215248-3176252227-56794-26710-0000
(default) at scheduler-5b460b2b-88e2-4c5a-8151-9f1ace26c8a2@67.195.81.189:56794
I1106 21:52:49.147205 26725 hierarchical_allocator_process.hpp:329] Added framework 20141106-215248-3176252227-56794-26710-0000
I1106 21:52:49.147224 26725 hierarchical_allocator_process.hpp:697] No resources available
to allocate!
I1106 21:52:49.147233 26725 hierarchical_allocator_process.hpp:659] Performed allocation for
0 slaves in 10449ns
    @     0x2b83045d8deb os::Linux::chained_handler()
I1106 21:52:49.147524 26730 sched.cpp:407] Framework registered with 20141106-215248-3176252227-56794-26710-0000
I1106 21:52:49.147584 26730 sched.cpp:421] Scheduler::registered took 37067ns
    @     0x2b83045dc420 JVM_handle_linux_signal
    @     0x2b83045d8cfe signalHandler()
    @     0x2b82b5936340 (unknown)
    @     0x2b82b51c15c8 (unknown)
    @           0x994910 _ZNSt10_List_nodeISsEC2IJRKSsEEEDpOT_
    @           0x97ece2 _ZN9__gnu_cxx13new_allocatorISt10_List_nodeISsEE9constructIS2_JRKSsEEEvPT_DpOT0_
    @           0x95cab6 std::list<>::_M_create_node<>()
    @           0x93dac4 std::list<>::_M_insert<>()
    @           0x97ec49 _ZNSt4listISsSaISsEE12emplace_backIJRKSsEEEvDpOT_
    @           0x95c954 std::list<>::_M_initialize_dispatch<>()
    @           0x93d901 std::list<>::list()
    @           0xb15c47 mesos::internal::cram_md5::Property::Property()
    @     0x2b82b2ba1678 std::_List_node<>::_List_node<>()
    @     0x2b82b2ba02ce _ZN9__gnu_cxx13new_allocatorISt10_List_nodeIN5mesos8internal8cram_md58PropertyEEE9constructIS6_JRKS5_EEEvPT_DpOT0_
    @     0x2b82b2b9e4f6 _ZNSt4listIN5mesos8internal8cram_md58PropertyESaIS3_EE14_M_create_nodeIJRKS3_EEEPSt10_List_nodeIS3_EDpOT_
    @     0x2b82b2b9be46 _ZNSt4listIN5mesos8internal8cram_md58PropertyESaIS3_EE9_M_insertIJRKS3_EEEvSt14_List_iteratorIS3_EDpOT_
    @     0x2b82b2b99fa6 std::list<>::push_back()
    @     0x2b82b2b98384 Multimap<>::get()
    @     0x2b82b2b951e1 mesos::internal::cram_md5::InMemoryAuxiliaryPropertyPlugin::lookup()
    @     0x2b82b2b946bd mesos::internal::cram_md5::InMemoryAuxiliaryPropertyPlugin::lookup()
    @     0x2b82b4ce6e29 (unknown)
    @     0x2b82b4ce7be5 (unknown)
    @     0x2b82bb0af52e (unknown)
    @     0x2b82bb0af929 (unknown)
    @     0x2b82b4cf3628 (unknown)
    @           0xb128ba mesos::internal::cram_md5::CRAMMD5AuthenticatorProcess::step()
    @           0xb19a21 ProtobufProcess<>::_handler1<>()
    @           0xb2b661 _ZNSt5_BindIFPFvPN5mesos8internal8cram_md527CRAMMD5AuthenticatorProcessEMS3_FvRKSsEMNS1_25AuthenticationStepMessageEKFS6_vERKN7process4UPIDES6_ES4_S8_SB_St12_PlaceholderILi1EESI_ILi2EEEE6__callIvJSF_S6_EJLm0ELm1ELm2ELm3ELm4EEEET_OSt5tupleIJDpT0_EESt12_Index_tupleIJXspT1_EEE
    @           0xb26bc4 _ZNSt5_BindIFPFvPN5mesos8internal8cram_md527CRAMMD5AuthenticatorProcessEMS3_FvRKSsEMNS1_25AuthenticationStepMessageEKFS6_vERKN7process4UPIDES6_ES4_S8_SB_St12_PlaceholderILi1EESI_ILi2EEEEclIJSF_S6_EvEET0_DpOT_
    @           0xb22773 std::_Function_handler<>::_M_invoke()
make[3]: *** [check-local] Segmentation fault
make[3]: Leaving directory `<https://builds.apache.org/job/Mesos-Trunk-Ubuntu-Build-In-Src-Set-JAVA_HOME/ws/src'>
make[2]: *** [check-am] Error 2
make[2]: Leaving directory `<https://builds.apache.org/job/Mesos-Trunk-Ubuntu-Build-In-Src-Set-JAVA_HOME/ws/src'>
make[1]: *** [check] Error 2
make[1]: Leaving directory `<https://builds.apache.org/job/Mesos-Trunk-Ubuntu-Build-In-Src-Set-JAVA_HOME/ws/src'>
make: *** [check-recursive] Error 1
Test finished
Exit status: 2
Build step 'Execute shell' marked build as failure
Recording test results

Mime
View raw message