mesos-dev mailing list archives

Site index · List index
Message view « Date » · « Thread »
Top « Date » · « Thread »
From Niklas Nielsen <nik...@mesosphere.io>
Subject Re: Build failed in Jenkins: Mesos-Trunk-Ubuntu-Build-Out-Of-Src-Disable-Java-Disable-Python-Disable-Webui #2454
Date Thu, 16 Oct 2014 22:49:11 GMT
Sorry about that - we are on it.

Niklas

On 16 October 2014 15:39, Apache Jenkins Server <jenkins@builds.apache.org>
wrote:

> See <
> https://builds.apache.org/job/Mesos-Trunk-Ubuntu-Build-Out-Of-Src-Disable-Java-Disable-Python-Disable-Webui/2454/changes
> >
>
> Changes:
>
> [niklas] Allowed unloading of a single module.
>
> ------------------------------------------
> [...truncated 32087 lines...]
> Using temporary directory '/tmp/RateLimitingTest_CapacityReached_Skya7t'
> I1016 22:38:58.462175 16220 leveldb.cpp:176] Opened db in 2.003166ms
> I1016 22:38:58.462945 16220 leveldb.cpp:183] Compacted db in 744329ns
> I1016 22:38:58.462970 16220 leveldb.cpp:198] Created db iterator in 3948ns
> I1016 22:38:58.462978 16220 leveldb.cpp:204] Seeked to beginning of db in
> 757ns
> I1016 22:38:58.462985 16220 leveldb.cpp:273] Iterated through 0 keys in
> the db in 275ns
> I1016 22:38:58.463001 16220 replica.cpp:741] Replica recovered with log
> positions 0 -> 0 with 1 holes and 0 unlearned
> I1016 22:38:58.463196 16249 recover.cpp:425] Starting replica recovery
> I1016 22:38:58.463299 16236 recover.cpp:451] Replica is in EMPTY status
> I1016 22:38:58.463640 16242 replica.cpp:638] Replica in EMPTY status
> received a broadcasted recover request
> I1016 22:38:58.463742 16251 recover.cpp:188] Received a recover response
> from a replica in EMPTY status
> I1016 22:38:58.463881 16241 recover.cpp:542] Updating replica status to
> STARTING
> I1016 22:38:58.464287 16240 leveldb.cpp:306] Persisting metadata (8 bytes)
> to leveldb took 306803ns
> I1016 22:38:58.464303 16240 replica.cpp:320] Persisted replica status to
> STARTING
> I1016 22:38:58.464306 16248 master.cpp:312] Master
> 20141016-223858-3193029443-47942-16220 (pietas.apache.org) started on
> 67.195.81.190:47942
> I1016 22:38:58.464375 16248 master.cpp:358] Master only allowing
> authenticated frameworks to register
> I1016 22:38:58.464436 16246 recover.cpp:451] Replica is in STARTING status
> I1016 22:38:58.464455 16248 master.cpp:363] Master only allowing
> authenticated slaves to register
> I1016 22:38:58.464470 16248 credentials.hpp:36] Loading credentials for
> authentication from
> '/tmp/RateLimitingTest_CapacityReached_Skya7t/credentials'
> I1016 22:38:58.464586 16248 master.cpp:392] Authorization enabled
> I1016 22:38:58.464710 16248 master.cpp:439] Framework rate limiting enabled
> I1016 22:38:58.464787 16239 replica.cpp:638] Replica in STARTING status
> received a broadcasted recover request
> I1016 22:38:58.464884 16241 master.cpp:120] No whitelist given.
> Advertising offers for all slaves
> I1016 22:38:58.464908 16249 recover.cpp:188] Received a recover response
> from a replica in STARTING status
> I1016 22:38:58.464963 16242 hierarchical_allocator_process.hpp:299]
> Initializing hierarchical allocator process with master :
> master@67.195.81.190:47942
> I1016 22:38:58.465041 16237 recover.cpp:542] Updating replica status to
> VOTING
> I1016 22:38:58.465261 16248 master.cpp:1242] The newly elected leader is
> master@67.195.81.190:47942 with id 20141016-223858-3193029443-47942-16220
> I1016 22:38:58.465281 16248 master.cpp:1255] Elected as the leading master!
> I1016 22:38:58.465291 16248 master.cpp:1073] Recovering from registrar
> I1016 22:38:58.465337 16251 registrar.cpp:313] Recovering registrar
> I1016 22:38:58.465591 16249 leveldb.cpp:306] Persisting metadata (8 bytes)
> to leveldb took 479322ns
> I1016 22:38:58.465606 16249 replica.cpp:320] Persisted replica status to
> VOTING
> I1016 22:38:58.465639 16249 recover.cpp:556] Successfully joined the Paxos
> group
> I1016 22:38:58.465713 16249 recover.cpp:440] Recover process terminated
> I1016 22:38:58.465911 16236 log.cpp:656] Attempting to start the writer
> I1016 22:38:58.466491 16238 replica.cpp:474] Replica received implicit
> promise request with proposal 1
> I1016 22:38:58.466958 16238 leveldb.cpp:306] Persisting metadata (8 bytes)
> to leveldb took 445001ns
> I1016 22:38:58.466979 16238 replica.cpp:342] Persisted promised to 1
> I1016 22:38:58.467226 16247 coordinator.cpp:230] Coordinator attemping to
> fill missing position
> I1016 22:38:58.467710 16237 replica.cpp:375] Replica received explicit
> promise request for position 0 with proposal 2
> I1016 22:38:58.468109 16237 leveldb.cpp:343] Persisting action (8 bytes)
> to leveldb took 379158ns
> I1016 22:38:58.468123 16237 replica.cpp:676] Persisted action at 0
> I1016 22:38:58.468566 16251 replica.cpp:508] Replica received write
> request for position 0
> I1016 22:38:58.468611 16251 leveldb.cpp:438] Reading position from leveldb
> took 28003ns
> I1016 22:38:58.468968 16251 leveldb.cpp:343] Persisting action (14 bytes)
> to leveldb took 342369ns
> I1016 22:38:58.468983 16251 replica.cpp:676] Persisted action at 0
> I1016 22:38:58.469249 16248 replica.cpp:655] Replica received learned
> notice for position 0
> I1016 22:38:58.469403 16248 leveldb.cpp:343] Persisting action (16 bytes)
> to leveldb took 133065ns
> I1016 22:38:58.469419 16248 replica.cpp:676] Persisted action at 0
> I1016 22:38:58.469460 16248 replica.cpp:661] Replica learned NOP action at
> position 0
> I1016 22:38:58.469724 16249 log.cpp:672] Writer started with ending
> position 0
> I1016 22:38:58.470041 16237 leveldb.cpp:438] Reading position from leveldb
> took 11265ns
> I1016 22:38:58.471061 16248 registrar.cpp:346] Successfully fetched the
> registry (0B) in 5.70624ms
> I1016 22:38:58.471099 16248 registrar.cpp:445] Applied 1 operations in
> 2507ns; attempting to update the 'registry'
> I1016 22:38:58.472033 16242 log.cpp:680] Attempting to append 139 bytes to
> the log
> I1016 22:38:58.472091 16249 coordinator.cpp:340] Coordinator attempting to
> write APPEND action at position 1
> I1016 22:38:58.472417 16237 replica.cpp:508] Replica received write
> request for position 1
> I1016 22:38:58.472954 16237 leveldb.cpp:343] Persisting action (158 bytes)
> to leveldb took 476283ns
> I1016 22:38:58.472969 16237 replica.cpp:676] Persisted action at 1
> I1016 22:38:58.473220 16240 replica.cpp:655] Replica received learned
> notice for position 1
> I1016 22:38:58.473372 16240 leveldb.cpp:343] Persisting action (160 bytes)
> to leveldb took 132831ns
> I1016 22:38:58.473389 16240 replica.cpp:676] Persisted action at 1
> I1016 22:38:58.473399 16240 replica.cpp:661] Replica learned APPEND action
> at position 1
> I1016 22:38:58.473657 16238 registrar.cpp:490] Successfully updated the
> 'registry' in 2.543872ms
> I1016 22:38:58.473716 16238 registrar.cpp:376] Successfully recovered
> registrar
> I1016 22:38:58.473748 16240 log.cpp:699] Attempting to truncate the log to
> 1
> I1016 22:38:58.473798 16238 coordinator.cpp:340] Coordinator attempting to
> write TRUNCATE action at position 2
> I1016 22:38:58.473799 16251 master.cpp:1100] Recovered 0 slaves from the
> Registry (101B) ; allowing 10mins for slaves to re-register
> I1016 22:38:58.474083 16237 replica.cpp:508] Replica received write
> request for position 2
> I1016 22:38:58.474544 16237 leveldb.cpp:343] Persisting action (16 bytes)
> to leveldb took 442181ns
> I1016 22:38:58.474557 16237 replica.cpp:676] Persisted action at 2
> I1016 22:38:58.474738 16247 replica.cpp:655] Replica received learned
> notice for position 2
> I1016 22:38:58.475297 16247 leveldb.cpp:343] Persisting action (18 bytes)
> to leveldb took 539482ns
> I1016 22:38:58.475328 16247 leveldb.cpp:401] Deleting ~1 keys from leveldb
> took 14678ns
> I1016 22:38:58.475342 16247 replica.cpp:676] Persisted action at 2
> I1016 22:38:58.475353 16247 replica.cpp:661] Replica learned TRUNCATE
> action at position 2
> I1016 22:38:58.486491 16220 sched.cpp:137] Version: 0.21.0
> I1016 22:38:58.486690 16241 sched.cpp:233] New master detected at
> master@67.195.81.190:47942
> I1016 22:38:58.486711 16241 sched.cpp:283] Authenticating with master
> master@67.195.81.190:47942
> I1016 22:38:58.486790 16241 authenticatee.hpp:133] Creating new client
> SASL connection
> I1016 22:38:58.486866 16241 master.cpp:3787] Authenticating
> scheduler-673b6fed-4e8f-4fd4-85de-53cf5c865263@67.195.81.190:47942
> I1016 22:38:58.486944 16241 authenticator.hpp:161] Creating new server
> SASL connection
> I1016 22:38:58.486997 16241 authenticatee.hpp:224] Received SASL
> authentication mechanisms: CRAM-MD5
> I1016 22:38:58.487013 16241 authenticatee.hpp:250] Attempting to
> authenticate with mechanism 'CRAM-MD5'
> I1016 22:38:58.487079 16242 authenticator.hpp:267] Received SASL
> authentication start
> I1016 22:38:58.487119 16242 authenticator.hpp:389] Authentication requires
> more steps
> I1016 22:38:58.487154 16242 authenticatee.hpp:270] Received SASL
> authentication step
> I1016 22:38:58.487207 16241 authenticator.hpp:295] Received SASL
> authentication step
> I1016 22:38:58.487236 16241 auxprop.cpp:81] Request to lookup properties
> for user: 'test-principal' realm: 'pietas.apache.org' server FQDN: '
> pietas.apache.org' SASL_AUXPROP_VERIFY_AGAINST_HASH: false
> SASL_AUXPROP_OVERRIDE: false SASL_AUXPROP_AUTHZID: false
> I1016 22:38:58.487248 16241 auxprop.cpp:153] Looking up auxiliary property
> '*userPassword'
> I1016 22:38:58.487257 16241 auxprop.cpp:153] Looking up auxiliary property
> '*cmusaslsecretCRAM-MD5'
> I1016 22:38:58.487264 16241 auxprop.cpp:81] Request to lookup properties
> for user: 'test-principal' realm: 'pietas.apache.org' server FQDN: '
> pietas.apache.org' SASL_AUXPROP_VERIFY_AGAINST_HASH: false
> SASL_AUXPROP_OVERRIDE: false SASL_AUXPROP_AUTHZID: true
> I1016 22:38:58.487269 16241 auxprop.cpp:103] Skipping auxiliary property
> '*userPassword' since SASL_AUXPROP_AUTHZID == true
> I1016 22:38:58.487273 16241 auxprop.cpp:103] Skipping auxiliary property
> '*cmusaslsecretCRAM-MD5' since SASL_AUXPROP_AUTHZID == true
> I1016 22:38:58.487283 16241 authenticator.hpp:381] Authentication success
> I1016 22:38:58.487329 16242 authenticatee.hpp:310] Authentication success
> I1016 22:38:58.487349 16241 master.cpp:3827] Successfully authenticated
> principal 'test-principal' at
> scheduler-673b6fed-4e8f-4fd4-85de-53cf5c865263@67.195.81.190:47942
> I1016 22:38:58.487500 16242 sched.cpp:357] Successfully authenticated with
> master master@67.195.81.190:47942
> I1016 22:38:58.487517 16242 sched.cpp:476] Sending registration request to
> master@67.195.81.190:47942
> I1016 22:38:58.487617 16240 master.cpp:1362] Received registration request
> for framework 'default' at
> scheduler-673b6fed-4e8f-4fd4-85de-53cf5c865263@67.195.81.190:47942
> I1016 22:38:58.487640 16240 master.cpp:1321] Authorizing framework
> principal 'test-principal' to receive offers for role '*'
> I1016 22:38:58.487756 16251 master.cpp:1426] Registering framework
> 20141016-223858-3193029443-47942-16220-0000 (default) at
> scheduler-673b6fed-4e8f-4fd4-85de-53cf5c865263@67.195.81.190:47942
> I1016 22:38:58.487844 16237 hierarchical_allocator_process.hpp:329] Added
> framework 20141016-223858-3193029443-47942-16220-0000
> I1016 22:38:58.487859 16237 hierarchical_allocator_process.hpp:697] No
> resources available to allocate!
> I1016 22:38:58.487867 16237 hierarchical_allocator_process.hpp:659]
> Performed allocation for 0 slaves in 8808ns
> I1016 22:38:58.487875 16238 sched.cpp:407] Framework registered with
> 20141016-223858-3193029443-47942-16220-0000
> I1016 22:38:58.487903 16238 sched.cpp:421] Scheduler::registered took
> 13805ns
> I1016 22:38:58.507036 16242 master.cpp:1362] Received registration request
> for framework 'default' at
> scheduler-673b6fed-4e8f-4fd4-85de-53cf5c865263@67.195.81.190:47942
> I1016 22:38:58.507072 16242 master.cpp:1321] Authorizing framework
> principal 'test-principal' to receive offers for role '*'
> I1016 22:38:58.507199 16241 master.cpp:1413] Framework
> 20141016-223858-3193029443-47942-16220-0000 (default) at
> scheduler-673b6fed-4e8f-4fd4-85de-53cf5c865263@67.195.81.190:47942
> already registered, resending acknowledgement
> I1016 22:38:58.507290 16239 sched.cpp:394] Ignoring framework registered
> message because the driver is already connected!
> I1016 22:38:58.517200 16250 process.cpp:3358] Handling HTTP event for
> process 'metrics' with path: '/metrics/snapshot'
> W1016 22:38:58.538029 16246 master.cpp:1035] Dropping message
> mesos.internal.RegisterFrameworkMessage from
> scheduler-673b6fed-4e8f-4fd4-85de-53cf5c865263@67.195.81.190:47942(test-principal):
> capacity(2) exceeded
> I1016 22:38:58.538115 16246 sched.cpp:729] Got error 'Message
> mesos.internal.RegisterFrameworkMessage dropped: capacity(2) exceeded'
> I1016 22:38:58.538194 16246 sched.cpp:740] Scheduler::error took 13045ns
> I1016 22:38:58.538211 16246 sched.cpp:770] Aborting framework
> '20141016-223858-3193029443-47942-16220-0000'
> W1016 22:38:58.538242 16246 master.cpp:1035] Dropping message
> mesos.internal.DeactivateFrameworkMessage from
> scheduler-673b6fed-4e8f-4fd4-85de-53cf5c865263@67.195.81.190:47942(test-principal):
> capacity(2) exceeded
> I1016 22:38:58.538297 16246 sched.cpp:725] Ignoring error message because
> the driver is aborted!
> I1016 22:38:58.568693 16239 hierarchical_allocator_process.hpp:697] No
> resources available to allocate!
> I1016 22:38:58.568712 16239 hierarchical_allocator_process.hpp:659]
> Performed allocation for 0 slaves in 28128ns
> I1016 22:38:58.568748 16239 process.cpp:3358] Handling HTTP event for
> process 'metrics' with path: '/metrics/snapshot'
> I1016 22:38:58.579454 16250 hierarchical_allocator_process.hpp:697] No
> resources available to allocate!
> I1016 22:38:58.579471 16250 hierarchical_allocator_process.hpp:659]
> Performed allocation for 0 slaves in 52830ns
> I1016 22:38:58.579538 16238 master.cpp:1362] Received registration request
> for framework 'default' at
> scheduler-673b6fed-4e8f-4fd4-85de-53cf5c865263@67.195.81.190:47942
> I1016 22:38:58.579570 16238 master.cpp:1321] Authorizing framework
> principal 'test-principal' to receive offers for role '*'
> I1016 22:38:58.579747 16241 master.cpp:1413] Framework
> 20141016-223858-3193029443-47942-16220-0000 (default) at
> scheduler-673b6fed-4e8f-4fd4-85de-53cf5c865263@67.195.81.190:47942
> already registered, resending acknowledgement
> I1016 22:38:58.589529 16247 hierarchical_allocator_process.hpp:697] No
> resources available to allocate!
> I1016 22:38:58.589540 16246 master.cpp:1362] Received registration request
> for framework 'default' at
> scheduler-673b6fed-4e8f-4fd4-85de-53cf5c865263@67.195.81.190:47942
> I1016 22:38:58.589543 16247 hierarchical_allocator_process.hpp:659]
> Performed allocation for 0 slaves in 25321ns
> I1016 22:38:58.589568 16246 master.cpp:1321] Authorizing framework
> principal 'test-principal' to receive offers for role '*'
> I1016 22:38:58.589812 16245 master.cpp:1413] Framework
> 20141016-223858-3193029443-47942-16220-0000 (default) at
> scheduler-673b6fed-4e8f-4fd4-85de-53cf5c865263@67.195.81.190:47942
> already registered, resending acknowledgement
> I1016 22:38:58.599666 16236 hierarchical_allocator_process.hpp:697] No
> resources available to allocate!
> I1016 22:38:58.599668 16243 master.cpp:768] Framework
> 20141016-223858-3193029443-47942-16220-0000 (default) at
> scheduler-673b6fed-4e8f-4fd4-85de-53cf5c865263@67.195.81.190:47942
> disconnected
> I1016 22:38:58.599688 16236 hierarchical_allocator_process.hpp:659]
> Performed allocation for 0 slaves in 34739ns
> I1016 22:38:58.599690 16243 master.cpp:1731] Disconnecting framework
> 20141016-223858-3193029443-47942-16220-0000 (default) at
> scheduler-673b6fed-4e8f-4fd4-85de-53cf5c865263@67.195.81.190:47942
> I1016 22:38:58.599699 16243 master.cpp:1747] Deactivating framework
> 20141016-223858-3193029443-47942-16220-0000 (default) at
> scheduler-673b6fed-4e8f-4fd4-85de-53cf5c865263@67.195.81.190:47942
> I1016 22:38:58.599725 16243 master.cpp:790] Giving framework
> 20141016-223858-3193029443-47942-16220-0000 (default) at
> scheduler-673b6fed-4e8f-4fd4-85de-53cf5c865263@67.195.81.190:47942 10secs
> to failover
> I1016 22:38:58.599761 16249 hierarchical_allocator_process.hpp:405]
> Deactivated framework 20141016-223858-3193029443-47942-16220-0000
> I1016 22:38:58.609884 16238 process.cpp:3358] Handling HTTP event for
> process 'metrics' with path: '/metrics/snapshot'
> I1016 22:38:58.620491 16220 master.cpp:677] Master terminating
> [       OK ] RateLimitingTest.CapacityReached (164 ms)
> [----------] 6 tests from RateLimitingTest (941 ms total)
>
> [----------] 7 tests from MesosContainerizerProcessTest
> [ RUN      ] MesosContainerizerProcessTest.NoExtractExecutable
> [       OK ] MesosContainerizerProcessTest.NoExtractExecutable (0 ms)
> [ RUN      ] MesosContainerizerProcessTest.EmptyHadoop
> [       OK ] MesosContainerizerProcessTest.EmptyHadoop (0 ms)
> [ RUN      ] MesosContainerizerProcessTest.Simple
> [       OK ] MesosContainerizerProcessTest.Simple (1 ms)
> [ RUN      ] MesosContainerizerProcessTest.MultipleURIs
> [       OK ] MesosContainerizerProcessTest.MultipleURIs (0 ms)
> [ RUN      ] MesosContainerizerProcessTest.NoUser
> [       OK ] MesosContainerizerProcessTest.NoUser (0 ms)
> [ RUN      ] MesosContainerizerProcessTest.NoExtract
> [       OK ] MesosContainerizerProcessTest.NoExtract (0 ms)
> [ RUN      ] MesosContainerizerProcessTest.NoHadoop
> [       OK ] MesosContainerizerProcessTest.NoHadoop (1 ms)
> [----------] 7 tests from MesosContainerizerProcessTest (2 ms total)
>
> [----------] 14 tests from ModuleTest
> [ RUN      ] ModuleTest.NewerModuleLibrary
> Using temporary directory '/tmp/ModuleTest_NewerModuleLibrary_cYOr3Q'
> [       OK ] ModuleTest.NewerModuleLibrary (0 ms)
> [ RUN      ] ModuleTest.LibraryNameWithExtension
> Using temporary directory '/tmp/ModuleTest_LibraryNameWithExtension_8pbOZd'
> ../../src/tests/module_tests.cpp:158: Failure
> ModuleManager::load(modules): Error verifying module
> 'org_apache_mesos_TestModule': Mesos has version 0.21.0, but module is
> compiled with version 100.1.0
> ../../src/tests/module_tests.cpp:163: Failure
> ModuleManager::unload(moduleName): Error unloading module
> 'org_apache_mesos_TestModule': module not loaded
> [  FAILED  ] ModuleTest.LibraryNameWithExtension (1 ms)
> [ RUN      ] ModuleTest.LibraryNameWithoutExtension
> Using temporary directory
> '/tmp/ModuleTest_LibraryNameWithoutExtension_a4ieWA'
> ../../src/tests/module_tests.cpp:130: Failure
> ModuleManager::load(modules): Error verifying module
> 'org_apache_mesos_TestModule': Mesos has version 0.21.0, but module is
> compiled with version 100.1.0
> ../../src/tests/module_tests.cpp:135: Failure
> ModuleManager::unload(moduleName): Error unloading module
> 'org_apache_mesos_TestModule': module not loaded
> [  FAILED  ] ModuleTest.LibraryNameWithoutExtension (0 ms)
> [ RUN      ] ModuleTest.NonModuleLibrary
> Using temporary directory '/tmp/ModuleTest_NonModuleLibrary_auAHSX'
> [       OK ] ModuleTest.NonModuleLibrary (0 ms)
> [ RUN      ] ModuleTest.EmptyLibraryFilename
> Using temporary directory '/tmp/ModuleTest_EmptyLibraryFilename_mtIePk'
> [       OK ] ModuleTest.EmptyLibraryFilename (0 ms)
> [ RUN      ] ModuleTest.OlderModuleLibrary
> Using temporary directory '/tmp/ModuleTest_OlderModuleLibrary_C4YOLH'
> [       OK ] ModuleTest.OlderModuleLibrary (0 ms)
> [ RUN      ] ModuleTest.UnknownLibraryTest
> Using temporary directory '/tmp/ModuleTest_UnknownLibraryTest_OvksI4'
> [       OK ] ModuleTest.UnknownLibraryTest (0 ms)
> [ RUN      ] ModuleTest.UnknownModuleInstantiationTest
> Using temporary directory
> '/tmp/ModuleTest_UnknownModuleInstantiationTest_UYk9Er'
> ../../src/tests/module_tests.cpp:230: Failure
> ModuleManager::load(modules): Error verifying module
> 'org_apache_mesos_TestModule': Minimum supported mesos version for
> 'TestModule' is 0.21.0, but module is compiled with version 0.1.0
> ../../src/tests/module_tests.cpp:234: Failure
> ModuleManager::unload(moduleName): Error unloading module
> 'org_apache_mesos_TestModule': module not loaded
> [  FAILED  ] ModuleTest.UnknownModuleInstantiationTest (1 ms)
> [ RUN      ] ModuleTest.EmptyModuleName
> Using temporary directory '/tmp/ModuleTest_EmptyModuleName_UQCUBO'
> [       OK ] ModuleTest.EmptyModuleName (0 ms)
> [ RUN      ] ModuleTest.DuplicateModule
> Using temporary directory '/tmp/ModuleTest_DuplicateModule_oI0Iyb'
> ../../src/tests/module_tests.cpp:266: Failure
> ModuleManager::unload(moduleName): Error unloading module
> 'org_apache_mesos_TestModule': module not loaded
> [  FAILED  ] ModuleTest.DuplicateModule (0 ms)
> [ RUN      ] ModuleTest.DifferentApiVersion
> Using temporary directory '/tmp/ModuleTest_DifferentApiVersion_0o6Avy'
> [       OK ] ModuleTest.DifferentApiVersion (1 ms)
> [ RUN      ] ModuleTest.AuthorInfoTest
> Using temporary directory '/tmp/ModuleTest_AuthorInfoTest_Y7dwsV'
> [       OK ] ModuleTest.AuthorInfoTest (0 ms)
> [ RUN      ] ModuleTest.ExampleModuleParseStringTest
> Using temporary directory
> '/tmp/ModuleTest_ExampleModuleParseStringTest_Ud2tpi'
> ../../src/tests/module_tests.cpp:75: Failure
> ModuleManager::load(modules): Error verifying module
> 'org_apache_mesos_TestModule': Module API version mismatch. Mesos has: 1,
> library requires: ThisIsNotAnAPIVersion!
> ../../src/tests/module_tests.cpp:78: Failure
> module: Module 'org_apache_mesos_TestModule' unknown
> ABORT:
> (../../3rdparty/libprocess/3rdparty/stout/include/stout/try.hpp:92):
> Try::get() but state == ERROR: Module 'org_apache_mesos_TestModule'
> unknown*** Aborted at 1413499138 (unix time) try "date -d @1413499138" if
> you are using GNU date ***
> PC: @     0x2ab13deefbb9 (unknown)
> *** SIGABRT (@0x95b00003f5c) received by PID 16220 (TID 0x2ab13b205f80)
> from PID 16220; stack trace: ***
>     @     0x2ab13dcab340 (unknown)
>     @     0x2ab13deefbb9 (unknown)
>     @     0x2ab13def2fc8 (unknown)
>     @           0x4bf182 _Abort()
>     @           0x4bf1bc _Abort()
>     @           0x7a9827
> ModuleTest_ExampleModuleParseStringTest_Test::TestBody()
>     @           0x97a7d3
> testing::internal::HandleExceptionsInMethodIfSupported<>()
>     @           0x9719a7 testing::Test::Run()
>     @           0x971a4e testing::TestInfo::Run()
>     @           0x971b55 testing::TestCase::Run()
>     @           0x971df8 testing::internal::UnitTestImpl::RunAllTests()
>     @           0x972097 testing::UnitTest::Run()
>     @           0x48fec3 main
>     @     0x2ab13dedaec5 (unknown)
>     @           0x49c508 (unknown)
> make[3]: *** [check-local] Aborted
> make[3]: Leaving directory `<
> https://builds.apache.org/job/Mesos-Trunk-Ubuntu-Build-Out-Of-Src-Disable-Java-Disable-Python-Disable-Webui/ws/build/src
> '>
> make[2]: *** [check-am] Error 2
> make[2]: Leaving directory `<
> https://builds.apache.org/job/Mesos-Trunk-Ubuntu-Build-Out-Of-Src-Disable-Java-Disable-Python-Disable-Webui/ws/build/src
> '>
> make[1]: *** [check] Error 2
> make[1]: Leaving directory `<
> https://builds.apache.org/job/Mesos-Trunk-Ubuntu-Build-Out-Of-Src-Disable-Java-Disable-Python-Disable-Webui/ws/build/src
> '>
> make: *** [check-recursive] Error 1
> I1016 22:39:01.826513 18326 exec.cpp:86] Committing suicide by killing the
> process group
> I1016 22:39:01.826925 18327 exec.cpp:86] Committing suicide by killing the
> process group
> I1016 22:39:01.827862 18354 exec.cpp:86] Committing suicide by killing the
> process group
> Test finished
> Exit status: 2
> Build step 'Execute shell' marked build as failure
> Recording test results
>

Mime
  • Unnamed multipart/alternative (inline, None, 0 bytes)
View raw message